BDBM50399393 CHEMBL2177635
SMILES: CCNc1ncc(cn1)-c1cn(nn1)-c1cc(ccc1C)C(=O)Nc1ccc(CN2CCN(C)CC2)c(c1)C(F)(F)F
InChI Key: InChIKey=KJOGLHQXZFOMRY-UHFFFAOYSA-N
Data: 1 IC50
Activity Spreadsheet -- Enzyme Inhibition Constant Data from BindingDB
Found 1 hit for monomerid = 50399393
Trg + Lig
Ki
nM
ΔG°
kcal/mole
IC50
nM
Kd
nM
EC50/IC50
nM
koff
s-1
kon
M-1s-1
pHTemp
°C
Bcr-Abl
(Homo sapiens (Human))
BDBM50399393
(CHEMBL2177635)
Show SMILES CCNc1ncc(cn1)-c1cn(nn1)-c1cc(ccc1C)C(=O)Nc1ccc(CN2CCN(C)CC2)c(c1)C(F)(F)F
Show InChI InChI=1S/C29H32F3N9O/c1-4-33-28-34-15-22(16-35-28)25-18-41(38-37-25)26-13-20(6-5-19(26)2)27(42)36-23-8-7-21(24(14-23)29(30,31)32)17-40-11-9-39(3)10-12-40/h5-8,13-16,18H,4,9-12,17H2,1-3H3,(H,36,42)(H,33,34,35)
NCI pathway
Reactome pathway
n/an/a 1.18n/an/an/an/an/an/a
Chinese Academy of Sciences
Curated by ChEMBL
Assay Description
Inhibition of wild type Bcr-Abl using Tyr2 peptide as substrate after 2 hrs by FRET-based Z'-Lyte assay
J Med Chem 55: 10033-46 (2012)
Article DOI: 10.1021/jm301188x
BindingDB Entry DOI: 10.7270/Q2N29Z23