BDBM50399429 CHEMBL2178328
SMILES: OCCc1cc(on1)-c1cncc(OC[C@@H]2CCCN2)c1
InChI Key: InChIKey=AZBCGDLXFUVTPO-ZDUSSCGKSA-N
Data: 1 IC50  2 EC50
Activity Spreadsheet -- Enzyme Inhibition Constant Data from BindingDB
Found 3 hits for monomerid = 50399429
Trg + Lig
Ki
nM
ΔG°
kcal/mole
IC50
nM
Kd
nM
EC50/IC50
nM
koff
s-1
kon
M-1s-1
pHTemp
°C
Neuronal acetylcholine receptor Alpha-4/Beta-2
(Homo sapiens (Human))
BDBM50399429
(CHEMBL2178328)
Show SMILES OCCc1cc(on1)-c1cncc(OC[C@@H]2CCCN2)c1 |r|
Show InChI InChI=1S/C15H19N3O3/c19-5-3-12-7-15(21-18-12)11-6-14(9-16-8-11)20-10-13-2-1-4-17-13/h6-9,13,17,19H,1-5,10H2/t13-/m0/s1
NCI pathway
Reactome pathway
n/an/an/an/a>100n/an/an/an/a
University of Illinois at Chicago
Curated by ChEMBL
Assay Description
Agonist activity at human alpha4beta2 nAChR expressed in human SH-EP1 cells assessed as stimulation of 86Rb+ efflux preincubated for 10 mins by liqui...
J Med Chem 55: 9998-10009 (2012)
Article DOI: 10.1021/jm301177j
BindingDB Entry DOI: 10.7270/Q2CJ8FM1
Neuronal acetylcholine receptor Alpha-4/Beta-2
(Homo sapiens (Human))
BDBM50399429
(CHEMBL2178328)
Show SMILES OCCc1cc(on1)-c1cncc(OC[C@@H]2CCCN2)c1 |r|
Show InChI InChI=1S/C15H19N3O3/c19-5-3-12-7-15(21-18-12)11-6-14(9-16-8-11)20-10-13-2-1-4-17-13/h6-9,13,17,19H,1-5,10H2/t13-/m0/s1
NCI pathway
Reactome pathway
n/an/an/an/a>100n/an/an/an/a
University of Illinois at Chicago
Curated by ChEMBL
Assay Description
Agonist activity at human alpha4beta2 nAChR expressed in human SH-EP1 cells assessed as stimulation of 86Rb+ efflux preincubated for 10 mins by liqui...
J Med Chem 55: 9998-10009 (2012)
Article DOI: 10.1021/jm301177j
BindingDB Entry DOI: 10.7270/Q2CJ8FM1
Neuronal acetylcholine receptor Alpha-4/Beta-2
(Homo sapiens (Human))
BDBM50399429
(CHEMBL2178328)
Show SMILES OCCc1cc(on1)-c1cncc(OC[C@@H]2CCCN2)c1 |r|
Show InChI InChI=1S/C15H19N3O3/c19-5-3-12-7-15(21-18-12)11-6-14(9-16-8-11)20-10-13-2-1-4-17-13/h6-9,13,17,19H,1-5,10H2/t13-/m0/s1
NCI pathway
Reactome pathway
n/an/a>100n/an/an/an/an/an/a
University of Illinois at Chicago
Curated by ChEMBL
Assay Description
Antagonist activity at human alpha4beta2 nAChR expressed in human SH-EP1 cells assessed as inhibition of 86Rb+ efflux preincubated for 10 mins by liq...
J Med Chem 55: 9998-10009 (2012)
Article DOI: 10.1021/jm301177j
BindingDB Entry DOI: 10.7270/Q2CJ8FM1