BDBM50399931 CHEMBL2181207
SMILES: CCCN1CNc2cc(Nc3ccnc4cc(Cl)ccc34)ccc2C1
InChI Key: InChIKey=PLENCLDCTYRFDI-UHFFFAOYSA-N
Data: 1 IC50
Activity Spreadsheet -- Enzyme Inhibition Constant Data from BindingDB
Found 1 hit for monomerid = 50399931
Trg + Lig
Ki
nM
ΔG°
kcal/mole
IC50
nM
Kd
nM
EC50/IC50
nM
koff
s-1
kon
M-1s-1
pHTemp
°C
Potassium voltage-gated channel subfamily H member 2
(Homo sapiens (Human))
BDBM50399931
(CHEMBL2181207)
Show SMILES CCCN1CNc2cc(Nc3ccnc4cc(Cl)ccc34)ccc2C1
Show InChI InChI=1S/C20H21ClN4/c1-2-9-25-12-14-3-5-16(11-19(14)23-13-25)24-18-7-8-22-20-10-15(21)4-6-17(18)20/h3-8,10-11,23H,2,9,12-13H2,1H3,(H,22,24)
Reactome pathway
n/an/a 22n/an/an/an/an/an/a
University of Siena
Curated by ChEMBL
Assay Description
Inhibition of human ERG expressed in rat after 2 to 3 days by patch clamp assay
J Med Chem 55: 10387-404 (2012)
Article DOI: 10.1021/jm300831b
BindingDB Entry DOI: 10.7270/Q2N017PR