BDBM50400094 CHEMBL427092
SMILES: COC(=O)c1ccc(O)c(NC(=O)COc2ccc(cc2)C23CC4CC(CC(C4)C2)C3)c1
InChI Key: InChIKey=BJRPPNOJYFZSLY-UHFFFAOYSA-N
Data: 1 KI  8 IC50
Activity Spreadsheet -- Enzyme Inhibition Constant Data from BindingDB
Found 9 hits for monomerid = 50400094
Trg + Lig
Ki
nM
ΔG°
kcal/mole
IC50
nM
Kd
nM
EC50/IC50
nM
koff
s-1
kon
M-1s-1
pHTemp
°C
Malate dehydrogenase, mitochondrial
(Homo sapiens (Human))
BDBM50400094
(CHEMBL427092)
Show SMILES COC(=O)c1ccc(O)c(NC(=O)COc2ccc(cc2)C23CC4CC(CC(C4)C2)C3)c1 |TLB:18:21:24.23.28:26,THB:22:23:26:30.21.29,22:21:24.23.28:26,29:21:24:28.27.26,29:27:24:30.22.21|
Show InChI InChI=1S/C26H29NO5/c1-31-25(30)19-2-7-23(28)22(11-19)27-24(29)15-32-21-5-3-20(4-6-21)26-12-16-8-17(13-26)10-18(9-16)14-26/h2-7,11,16-18,28H,8-10,12-15H2,1H3,(H,27,29)
Reactome pathway
1.90E+3n/an/an/an/an/an/an/an/a
Dongguk University-Seoul
Curated by ChEMBL
Assay Description
Competitive inhibition of MDH2 (unknown origin) using varying NADH level by oxaloacetate-dependent NADH oxidation based Lineweaver-Burk plot
J Med Chem 57: 9522-38 (2014)
Article DOI: 10.1021/jm501241g
BindingDB Entry DOI: 10.7270/Q2N87CCD
Malate dehydrogenase, mitochondrial
(Homo sapiens (Human))
BDBM50400094
(CHEMBL427092)
Show SMILES COC(=O)c1ccc(O)c(NC(=O)COc2ccc(cc2)C23CC4CC(CC(C4)C2)C3)c1 |TLB:18:21:24.23.28:26,THB:22:23:26:30.21.29,22:21:24.23.28:26,29:21:24:28.27.26,29:27:24:30.22.21|
Show InChI InChI=1S/C26H29NO5/c1-31-25(30)19-2-7-23(28)22(11-19)27-24(29)15-32-21-5-3-20(4-6-21)26-12-16-8-17(13-26)10-18(9-16)14-26/h2-7,11,16-18,28H,8-10,12-15H2,1H3,(H,27,29)
Reactome pathway
n/an/a 6.30E+3n/an/an/an/an/an/a
Dongguk University-Seoul
Curated by ChEMBL
Assay Description
Inhibition of MDH2 (unknown origin) pre-incubated for 1 hr followed by malate and NAD+ addition
J Med Chem 57: 9522-38 (2014)
Article DOI: 10.1021/jm501241g
BindingDB Entry DOI: 10.7270/Q2N87CCD
Hypoxia-inducible factor 1-alpha
(Homo sapiens (Human))
BDBM50400094
(CHEMBL427092)
Show SMILES COC(=O)c1ccc(O)c(NC(=O)COc2ccc(cc2)C23CC4CC(CC(C4)C2)C3)c1 |TLB:18:21:24.23.28:26,THB:22:23:26:30.21.29,22:21:24.23.28:26,29:21:24:28.27.26,29:27:24:30.22.21|
Show InChI InChI=1S/C26H29NO5/c1-31-25(30)19-2-7-23(28)22(11-19)27-24(29)15-32-21-5-3-20(4-6-21)26-12-16-8-17(13-26)10-18(9-16)14-26/h2-7,11,16-18,28H,8-10,12-15H2,1H3,(H,27,29)
Reactome pathway
n/an/a 2.10E+4n/an/an/an/an/an/a
Gakushuin University
Curated by ChEMBL
Assay Description
Inhibition of hypoxia-induced HIF1alpha transcriptional activity in human HeLa cells expressing HRE-Luc after 12 hrs by luciferase reporter gene assa...
ACS Med Chem Lett 4: 297-301 (2013)
Article DOI: 10.1021/ml3004632
BindingDB Entry DOI: 10.7270/Q2R212P9
von Hippel-Lindau disease tumor suppressor/Elongin-C/Elongin-B/HIF1A
(Homo sapiens (Human))
BDBM50400094
(CHEMBL427092)
Show SMILES COC(=O)c1ccc(O)c(NC(=O)COc2ccc(cc2)C23CC4CC(CC(C4)C2)C3)c1 |TLB:18:21:24.23.28:26,THB:22:23:26:30.21.29,22:21:24.23.28:26,29:21:24:28.27.26,29:27:24:30.22.21|
Show InChI InChI=1S/C26H29NO5/c1-31-25(30)19-2-7-23(28)22(11-19)27-24(29)15-32-21-5-3-20(4-6-21)26-12-16-8-17(13-26)10-18(9-16)14-26/h2-7,11,16-18,28H,8-10,12-15H2,1H3,(H,27,29)
Reactome pathway
n/an/a 3.08E+3n/an/an/an/an/an/a
Anhui Medical University
Curated by ChEMBL
Assay Description
Inhibition of HIF1alpha transcriptional activity in hypoxia-induced human HCCLM3 cells co-transfected with luciferase reporter plasmid containing fiv...
J Med Chem 62: 9299-9314 (2019)
Article DOI: 10.1021/acs.jmedchem.9b01313
Malate dehydrogenase cytoplasmic
(Homo sapiens (Human))
BDBM50400094
(CHEMBL427092)
Show SMILES COC(=O)c1ccc(O)c(NC(=O)COc2ccc(cc2)C23CC4CC(CC(C4)C2)C3)c1 |TLB:18:21:24.23.28:26,THB:22:23:26:30.21.29,22:21:24.23.28:26,29:21:24:28.27.26,29:27:24:30.22.21|
Show InChI InChI=1S/C26H29NO5/c1-31-25(30)19-2-7-23(28)22(11-19)27-24(29)15-32-21-5-3-20(4-6-21)26-12-16-8-17(13-26)10-18(9-16)14-26/h2-7,11,16-18,28H,8-10,12-15H2,1H3,(H,27,29)
Reactome pathway
n/an/a 1.10E+3n/an/an/an/an/an/a
College of Pharmacy, Dongguk University , Goyang 10326, Korea.
Curated by ChEMBL
Assay Description
Inhibition of MDH1 (unknown origin)
J Med Chem 60: 8631-8646 (2017)
Article DOI: 10.1021/acs.jmedchem.7b01231
BindingDB Entry DOI: 10.7270/Q2QZ2DCF
Malate dehydrogenase, mitochondrial
(Homo sapiens (Human))
BDBM50400094
(CHEMBL427092)
Show SMILES COC(=O)c1ccc(O)c(NC(=O)COc2ccc(cc2)C23CC4CC(CC(C4)C2)C3)c1 |TLB:18:21:24.23.28:26,THB:22:23:26:30.21.29,22:21:24.23.28:26,29:21:24:28.27.26,29:27:24:30.22.21|
Show InChI InChI=1S/C26H29NO5/c1-31-25(30)19-2-7-23(28)22(11-19)27-24(29)15-32-21-5-3-20(4-6-21)26-12-16-8-17(13-26)10-18(9-16)14-26/h2-7,11,16-18,28H,8-10,12-15H2,1H3,(H,27,29)
Reactome pathway
n/an/a 6.30E+3n/an/an/an/an/an/a
College of Pharmacy, Dongguk University , Goyang 10326, Korea.
Curated by ChEMBL
Assay Description
Inhibition of MDH2 (unknown origin)
J Med Chem 60: 8631-8646 (2017)
Article DOI: 10.1021/acs.jmedchem.7b01231
BindingDB Entry DOI: 10.7270/Q2QZ2DCF
Hypoxia inducible factors; HIF-1-alpha, HIF-2-alpha
(Homo sapiens (Human))
BDBM50400094
(CHEMBL427092)
Show SMILES COC(=O)c1ccc(O)c(NC(=O)COc2ccc(cc2)C23CC4CC(CC(C4)C2)C3)c1 |TLB:18:21:24.23.28:26,THB:22:23:26:30.21.29,22:21:24.23.28:26,29:21:24:28.27.26,29:27:24:30.22.21|
Show InChI InChI=1S/C26H29NO5/c1-31-25(30)19-2-7-23(28)22(11-19)27-24(29)15-32-21-5-3-20(4-6-21)26-12-16-8-17(13-26)10-18(9-16)14-26/h2-7,11,16-18,28H,8-10,12-15H2,1H3,(H,27,29)
n/an/a 2.60E+3n/an/an/an/an/an/a
Korea Research Institute of Bioscience and Biotechnology
Curated by ChEMBL
Assay Description
Inhibition of hypoxia induced HIF1 transcriptional activity in human Hep3B cells by cell-based HRE reporter assay
J Med Chem 50: 1675-84 (2007)
Article DOI: 10.1021/jm0610292
BindingDB Entry DOI: 10.7270/Q2FT8PSJ
Hypoxia-inducible factor 1-alpha
(Homo sapiens (Human))
BDBM50400094
(CHEMBL427092)
Show SMILES COC(=O)c1ccc(O)c(NC(=O)COc2ccc(cc2)C23CC4CC(CC(C4)C2)C3)c1 |TLB:18:21:24.23.28:26,THB:22:23:26:30.21.29,22:21:24.23.28:26,29:21:24:28.27.26,29:27:24:30.22.21|
Show InChI InChI=1S/C26H29NO5/c1-31-25(30)19-2-7-23(28)22(11-19)27-24(29)15-32-21-5-3-20(4-6-21)26-12-16-8-17(13-26)10-18(9-16)14-26/h2-7,11,16-18,28H,8-10,12-15H2,1H3,(H,27,29)
Reactome pathway
n/an/a 4.40E+3n/an/an/an/an/an/a
Dongguk University-Seoul
Curated by ChEMBL
Assay Description
Inhibition of HIF-1alpha in human HCT116 cells incubated for 12 hrs under hypoxic conditions by Western blotting and HRE-luciferase reporter assay
J Med Chem 57: 9522-38 (2014)
Article DOI: 10.1021/jm501241g
BindingDB Entry DOI: 10.7270/Q2N87CCD
Hypoxia-inducible factor 1-alpha
(Homo sapiens (Human))
BDBM50400094
(CHEMBL427092)
Show SMILES COC(=O)c1ccc(O)c(NC(=O)COc2ccc(cc2)C23CC4CC(CC(C4)C2)C3)c1 |TLB:18:21:24.23.28:26,THB:22:23:26:30.21.29,22:21:24.23.28:26,29:21:24:28.27.26,29:27:24:30.22.21|
Show InChI InChI=1S/C26H29NO5/c1-31-25(30)19-2-7-23(28)22(11-19)27-24(29)15-32-21-5-3-20(4-6-21)26-12-16-8-17(13-26)10-18(9-16)14-26/h2-7,11,16-18,28H,8-10,12-15H2,1H3,(H,27,29)
Reactome pathway
n/an/a 2.44E+3n/an/an/an/an/an/a
Dongguk University-Seoul
Curated by ChEMBL
Assay Description
Inhibition of HIF1alpha in human HCT116 cells under hypoxic condition after 16 hrs by dual luciferase reporter gene assay
J Med Chem 55: 10564-71 (2012)
Article DOI: 10.1021/jm301419d
BindingDB Entry DOI: 10.7270/Q2QR4Z8D