BDBM50400324 CHEMBL2181517
SMILES: CC(CSc1ccc(cc1)\N=C\c1c(O)ccc2ccccc12)c1ccccc1
InChI Key: InChIKey=BZZVABCIUQCUKN-WPWMEQJKSA-N
Data: 1 IC50
Activity Spreadsheet -- Enzyme Inhibition Constant Data from BindingDB
Found 1 hit for monomerid = 50400324
Trg + Lig
Ki
nM
ΔG°
kcal/mole
IC50
nM
Kd
nM
EC50/IC50
nM
koff
s-1
kon
M-1s-1
pHTemp
°C
NAD-Dependent Deacetylase Sirtuin-1
(Homo sapiens (Human))
BDBM50400324
(CHEMBL2181517)
Show SMILES CC(CSc1ccc(cc1)\N=C\c1c(O)ccc2ccccc12)c1ccccc1
Show InChI InChI=1S/C26H23NOS/c1-19(20-7-3-2-4-8-20)18-29-23-14-12-22(13-15-23)27-17-25-24-10-6-5-9-21(24)11-16-26(25)28/h2-17,19,28H,18H2,1H3/b27-17+
NCI pathway
Reactome pathway
n/an/a 4.03E+4n/an/an/an/an/an/a
Universit£ degli Studi di Roma La Sapienza
Curated by ChEMBL
Assay Description
Inhibition of human N-terminal GST-tagged SIRT1 expressed in Escherichia coli using Arg-His- Lys-Lys(Ac) as substrate after 1 hr by Fluor de Lys fluo...
J Med Chem 55: 10937-47 (2012)
Article DOI: 10.1021/jm3011614
BindingDB Entry DOI: 10.7270/Q28G8MVM