BDBM50400542 CHEMBL2204949
SMILES: COc1ccccc1CNC(=O)N[C@@H](CC(C)C)C(=O)NO
InChI Key: InChIKey=OCBWACJAYXFAFO-LBPRGKRZSA-N
Data: 3 IC50
Activity Spreadsheet -- Enzyme Inhibition Constant Data from BindingDB
Found 3 hits for monomerid = 50400542
Trg + Lig
Ki
nM
ΔG°
kcal/mole
IC50
nM
Kd
nM
EC50/IC50
nM
koff
s-1
kon
M-1s-1
pHTemp
°C
Aminopeptidase N
(Sus scrofa (Pig))
BDBM50400542
(CHEMBL2204949)
Show SMILES COc1ccccc1CNC(=O)N[C@@H](CC(C)C)C(=O)NO |r|
Show InChI InChI=1S/C15H23N3O4/c1-10(2)8-12(14(19)18-21)17-15(20)16-9-11-6-4-5-7-13(11)22-3/h4-7,10,12,21H,8-9H2,1-3H3,(H,18,19)(H2,16,17,20)/t12-/m0/s1
n/an/a 570n/an/an/an/an/an/a
TBA
Curated by ChEMBL
Assay Description
Inhibition of APN in porcine kidney microsome assessed as inhibition of L-Leu-p-nitroanilide substrate hydrolysis incubated for 5 mins before substra...
ACS Med Chem Lett 3: 959-964 (2012)
Article DOI: 10.1021/ml3000758
BindingDB Entry DOI: 10.7270/Q2QJ7JFR
Aminopeptidase N
(Homo sapiens (Human))
BDBM50400542
(CHEMBL2204949)
Show SMILES COc1ccccc1CNC(=O)N[C@@H](CC(C)C)C(=O)NO |r|
Show InChI InChI=1S/C15H23N3O4/c1-10(2)8-12(14(19)18-21)17-15(20)16-9-11-6-4-5-7-13(11)22-3/h4-7,10,12,21H,8-9H2,1-3H3,(H,18,19)(H2,16,17,20)/t12-/m0/s1
NCI pathway
Reactome pathway
n/an/a 1.10E+3n/an/an/an/an/an/a
TBA
Curated by ChEMBL
Assay Description
Inhibition of APN in human ES2 cell surface assessed as inhibition of L-Leu-p-nitroanilide substrate hydrolysis incubated for 5 mins before substrate...
ACS Med Chem Lett 3: 959-964 (2012)
Article DOI: 10.1021/ml3000758
BindingDB Entry DOI: 10.7270/Q2QJ7JFR
72 kDa type IV collagenase
(Homo sapiens (Human))
BDBM50400542
(CHEMBL2204949)
Show SMILES COc1ccccc1CNC(=O)N[C@@H](CC(C)C)C(=O)NO |r|
Show InChI InChI=1S/C15H23N3O4/c1-10(2)8-12(14(19)18-21)17-15(20)16-9-11-6-4-5-7-13(11)22-3/h4-7,10,12,21H,8-9H2,1-3H3,(H,18,19)(H2,16,17,20)/t12-/m0/s1
Reactome pathway
n/an/a>1.00E+6n/an/an/an/an/an/a
TBA
Curated by ChEMBL
Assay Description
Inhibition of recombinant MMP-2 using succinylated gelatin as substrate incubated for 10 mins before addition of substrate measured after 60 mins by ...
ACS Med Chem Lett 3: 959-964 (2012)
Article DOI: 10.1021/ml3000758
BindingDB Entry DOI: 10.7270/Q2QJ7JFR