BDBM50400663 CHEMBL2204240
SMILES: Clc1ccc(c(NC(=O)c2cccs2)c1)-c1nc2ccccc2[nH]c1=O
InChI Key: InChIKey=OQVDVROJIIHDBB-UHFFFAOYSA-N
Data: 1 IC50
Activity Spreadsheet -- Enzyme Inhibition Constant Data from BindingDB
Found 1 hit for monomerid = 50400663
Trg + Lig
Ki
nM
ΔG°
kcal/mole
IC50
nM
Kd
nM
EC50/IC50
nM
koff
s-1
kon
M-1s-1
pHTemp
°C
Serine/threonine-protein kinase 33
(Homo sapiens (Human))
BDBM50400663
(CHEMBL2204240)
Show SMILES Clc1ccc(c(NC(=O)c2cccs2)c1)-c1nc2ccccc2[nH]c1=O
Show InChI InChI=1S/C19H12ClN3O2S/c20-11-7-8-12(15(10-11)23-18(24)16-6-3-9-26-16)17-19(25)22-14-5-2-1-4-13(14)21-17/h1-10H,(H,22,25)(H,23,24)
n/an/a 270n/an/an/an/an/an/a
TBA
Curated by ChEMBL
Assay Description
Inhibition of N-terminal 6His-tagged full length human recombinant STK33 using myelin basic protein as substrate incubated for 15 mins before initiat...
ACS Med Chem Lett 3: 1034-1038 (2012)
Article DOI: 10.1021/ml300246r
BindingDB Entry DOI: 10.7270/Q2PK0H9X