BDBM50400887 CHEMBL2205038
SMILES: Cc1ccc(Sc2ccc(Cl)cc2)c(c1)N1CCNCC1
InChI Key: InChIKey=WTRJSQBNDURZJN-UHFFFAOYSA-N
Data: 2 KI  1 IC50
Activity Spreadsheet -- Enzyme Inhibition Constant Data from BindingDB
Found 3 hits for monomerid = 50400887
Trg + Lig
Ki
nM
ΔG°
kcal/mole
IC50
nM
Kd
nM
EC50/IC50
nM
koff
s-1
kon
M-1s-1
pHTemp
°C
5-hydroxytryptamine receptor 3A
(Homo sapiens (Human))
BDBM50400887
(CHEMBL2205038)
Show SMILES Cc1ccc(Sc2ccc(Cl)cc2)c(c1)N1CCNCC1
Show InChI InChI=1S/C17H19ClN2S/c1-13-2-7-17(21-15-5-3-14(18)4-6-15)16(12-13)20-10-8-19-9-11-20/h2-7,12,19H,8-11H2,1H3
Reactome pathway
500n/an/an/an/an/an/an/an/a
H. Lundbeck A/S
Curated by ChEMBL
Assay Description
Displacement of [3H]granisetron from human 5HT3A receptor expressed in HEK293 cells by filter binding assay
J Med Chem 54: 3206-21 (2011)
Article DOI: 10.1021/jm101459g
BindingDB Entry DOI: 10.7270/Q2W37XFC
5-hydroxytryptamine receptor 1A
(Homo sapiens (Human))
BDBM50400887
(CHEMBL2205038)
Show SMILES Cc1ccc(Sc2ccc(Cl)cc2)c(c1)N1CCNCC1
Show InChI InChI=1S/C17H19ClN2S/c1-13-2-7-17(21-15-5-3-14(18)4-6-15)16(12-13)20-10-8-19-9-11-20/h2-7,12,19H,8-11H2,1H3
2.50E+3n/an/an/an/an/an/an/an/a
H. Lundbeck A/S
Curated by ChEMBL
Assay Description
Displacement of [3H]5-carboxamidotryptamine to human 5HT1A expressed in HEK293 cells by filter binding assay
J Med Chem 54: 3206-21 (2011)
Article DOI: 10.1021/jm101459g
BindingDB Entry DOI: 10.7270/Q2W37XFC
Sodium-dependent serotonin transporter
(Rattus norvegicus (rat))
BDBM50400887
(CHEMBL2205038)
Show SMILES Cc1ccc(Sc2ccc(Cl)cc2)c(c1)N1CCNCC1
Show InChI InChI=1S/C17H19ClN2S/c1-13-2-7-17(21-15-5-3-14(18)4-6-15)16(12-13)20-10-8-19-9-11-20/h2-7,12,19H,8-11H2,1H3
n/an/a 9.5n/an/an/an/an/an/a
H. Lundbeck A/S
Curated by ChEMBL
Assay Description
Inhibition of SERT-mediated [3H]5HT uptake in rat synaptosomes by scintillation counting
J Med Chem 54: 3206-21 (2011)
Article DOI: 10.1021/jm101459g
BindingDB Entry DOI: 10.7270/Q2W37XFC