BDBM50401092 CHEMBL2204444
SMILES: CCN1CCC[C@H]1CC(=O)c1ccc(cc1)C#Cc1ccc(OC)cc1
InChI Key: InChIKey=IADYAKBUQIPXKK-NRFANRHFSA-N
Data: 1 IC50
Activity Spreadsheet -- Enzyme Inhibition Constant Data from BindingDB
Found 1 hit for monomerid = 50401092
Trg + Lig
Ki
nM
ΔG°
kcal/mole
IC50
nM
Kd
nM
EC50/IC50
nM
koff
s-1
kon
M-1s-1
pHTemp
°C
Metabotropic glutamate receptor 3
(Homo sapiens (Human))
BDBM50401092
(CHEMBL2204444)
Show SMILES CCN1CCC[C@H]1CC(=O)c1ccc(cc1)C#Cc1ccc(OC)cc1 |r|
Show InChI InChI=1S/C23H25NO2/c1-3-24-16-4-5-21(24)17-23(25)20-12-8-18(9-13-20)6-7-19-10-14-22(26-2)15-11-19/h8-15,21H,3-5,16-17H2,1-2H3/t21-/m0/s1
n/an/a>1.00E+4n/an/an/an/an/an/a
Vanderbilt University Medical Center
Curated by ChEMBL
Assay Description
Negative allosteric modulation of mGlu3 assessed as thaillium flux through GIRK channels by cell-based assay
Bioorg Med Chem Lett 22: 3921-5 (2012)
Article DOI: 10.1016/j.bmcl.2012.04.112
BindingDB Entry DOI: 10.7270/Q21N828X