BDBM50401114 CHEMBL2204476
SMILES: Cc1c(Cc2ccc(=O)n(Cc3ccc(F)cc3F)n2)c2ccccc2n1CC(O)=O
InChI Key: InChIKey=RHEGVACEQYWWGE-UHFFFAOYSA-N
Data: 1 IC50
Activity Spreadsheet -- Enzyme Inhibition Constant Data from BindingDB
Found 1 hit for monomerid = 50401114
Trg + Lig
Ki
nM
ΔG°
kcal/mole
IC50
nM
Kd
nM
EC50/IC50
nM
koff
s-1
kon
M-1s-1
pHTemp
°C
G protein-coupled receptor 44
(Homo sapiens (Human))
BDBM50401114
(CHEMBL2204476)
Show SMILES Cc1c(Cc2ccc(=O)n(Cc3ccc(F)cc3F)n2)c2ccccc2n1CC(O)=O
Show InChI InChI=1S/C23H19F2N3O3/c1-14-19(18-4-2-3-5-21(18)27(14)13-23(30)31)11-17-8-9-22(29)28(26-17)12-15-6-7-16(24)10-20(15)25/h2-10H,11-13H2,1H3,(H,30,31)
Reactome pathway
n/an/a 20n/an/an/an/an/an/a
Pfizer Inc.
Curated by ChEMBL
Assay Description
Displacement of [3H]PGD2 from recombinant human CRTH2 receptor expressed in CHO-K1 cells after 30 min by FRET method
J Med Chem 55: 5088-109 (2012)
Article DOI: 10.1021/jm300007n
BindingDB Entry DOI: 10.7270/Q2S75HH0