BDBM50401116 CHEMBL2204474
SMILES: Cc1c(Cc2ccc(=O)n(Cc3cc(F)c(F)cc3F)n2)c2cc(F)ccc2n1CC(O)=O
InChI Key: InChIKey=MMZWCUXUZYBSCN-UHFFFAOYSA-N
Data: 1 IC50
Activity Spreadsheet -- Enzyme Inhibition Constant Data from BindingDB
Found 1 hit for monomerid = 50401116
Trg + Lig
Ki
nM
ΔG°
kcal/mole
IC50
nM
Kd
nM
EC50/IC50
nM
koff
s-1
kon
M-1s-1
pHTemp
°C
G protein-coupled receptor 44
(Homo sapiens (Human))
BDBM50401116
(CHEMBL2204474)
Show SMILES Cc1c(Cc2ccc(=O)n(Cc3cc(F)c(F)cc3F)n2)c2cc(F)ccc2n1CC(O)=O
Show InChI InChI=1S/C23H17F4N3O3/c1-12-16(17-7-14(24)2-4-21(17)29(12)11-23(32)33)8-15-3-5-22(31)30(28-15)10-13-6-19(26)20(27)9-18(13)25/h2-7,9H,8,10-11H2,1H3,(H,32,33)
Reactome pathway
n/an/a 0.800n/an/an/an/an/an/a
Pfizer Inc.
Curated by ChEMBL
Assay Description
Displacement of [3H]PGD2 from recombinant human CRTH2 receptor expressed in CHO-K1 cells after 30 min by FRET method
J Med Chem 55: 5088-109 (2012)
Article DOI: 10.1021/jm300007n
BindingDB Entry DOI: 10.7270/Q2S75HH0