BDBM50401121 CHEMBL2205147
SMILES: Cc1c(CC2=NN(Cc3ccccc3)C(=O)CC2)c2cc(F)ccc2n1CC(O)=O
InChI Key: InChIKey=RAIPCZDMNHSRRS-UHFFFAOYSA-N
Data: 1 IC50
Activity Spreadsheet -- Enzyme Inhibition Constant Data from BindingDB
Found 1 hit for monomerid = 50401121
Trg + Lig
Ki
nM
ΔG°
kcal/mole
IC50
nM
Kd
nM
EC50/IC50
nM
koff
s-1
kon
M-1s-1
pHTemp
°C
G protein-coupled receptor 44
(Homo sapiens (Human))
BDBM50401121
(CHEMBL2205147)
Show SMILES Cc1c(CC2=NN(Cc3ccccc3)C(=O)CC2)c2cc(F)ccc2n1CC(O)=O |t:4|
Show InChI InChI=1S/C23H22FN3O3/c1-15-19(20-11-17(24)7-9-21(20)26(15)14-23(29)30)12-18-8-10-22(28)27(25-18)13-16-5-3-2-4-6-16/h2-7,9,11H,8,10,12-14H2,1H3,(H,29,30)
Reactome pathway
n/an/a 16n/an/an/an/an/an/a
Pfizer Inc.
Curated by ChEMBL
Assay Description
Displacement of [3H]PGD2 from recombinant human CRTH2 receptor expressed in CHO-K1 cells after 30 min by FRET method
J Med Chem 55: 5088-109 (2012)
Article DOI: 10.1021/jm300007n
BindingDB Entry DOI: 10.7270/Q2S75HH0