BDBM50401439 CHEMBL2207504
SMILES: Cc1nn(C)cc1-c1nc2ncc(Cl)c(N3CCN(Cc4cncnc4)CC3)c2[nH]1
InChI Key: InChIKey=NKTOEINNBIDTOF-UHFFFAOYSA-N
Data: 1 IC50  1 Kd
Activity Spreadsheet -- Enzyme Inhibition Constant Data from BindingDB
Found 2 hits for monomerid = 50401439
Trg + Lig
Ki
nM
ΔG°
kcal/mole
IC50
nM
Kd
nM
EC50/IC50
nM
koff
s-1
kon
M-1s-1
pHTemp
°C
Receptor-type tyrosine-protein kinase FLT3
(Homo sapiens (Human))
BDBM50401439
(CHEMBL2207504)
Show SMILES Cc1nn(C)cc1-c1nc2ncc(Cl)c(N3CCN(Cc4cncnc4)CC3)c2[nH]1
Show InChI InChI=1S/C20H22ClN9/c1-13-15(11-28(2)27-13)19-25-17-18(16(21)9-24-20(17)26-19)30-5-3-29(4-6-30)10-14-7-22-12-23-8-14/h7-9,11-12H,3-6,10H2,1-2H3,(H,24,25,26)
n/an/an/a 5.90n/an/an/an/an/a
The Institute of Cancer Research
Curated by ChEMBL
Assay Description
Binding affinity to FLT3
J Med Chem 55: 8721-34 (2012)
Article DOI: 10.1021/jm300952s
BindingDB Entry DOI: 10.7270/Q22J6D2W
Aurora kinase A
(Homo sapiens (Human))
BDBM50401439
(CHEMBL2207504)
Show SMILES Cc1nn(C)cc1-c1nc2ncc(Cl)c(N3CCN(Cc4cncnc4)CC3)c2[nH]1
Show InChI InChI=1S/C20H22ClN9/c1-13-15(11-28(2)27-13)19-25-17-18(16(21)9-24-20(17)26-19)30-5-3-29(4-6-30)10-14-7-22-12-23-8-14/h7-9,11-12H,3-6,10H2,1-2H3,(H,24,25,26)
NCI pathway
Reactome pathway
n/an/a 22n/an/an/an/an/an/a
The Institute of Cancer Research
Curated by ChEMBL
Assay Description
Binding affinity to Aurora A kinase
J Med Chem 55: 8721-34 (2012)
Article DOI: 10.1021/jm300952s
BindingDB Entry DOI: 10.7270/Q22J6D2W