BDBM50401619 CHEMBL2204588
SMILES: CNc1cc(Nc2cnc(C#N)c(O[C@H](C)CN(C)C)n2)ncc1C1CC1
InChI Key: InChIKey=CDRJFYVQRUTQKD-GFCCVEGCSA-N
Data: 3 IC50
Activity Spreadsheet -- Enzyme Inhibition Constant Data from BindingDB
Found 3 hits for monomerid = 50401619
Trg + Lig
Ki
nM
ΔG°
kcal/mole
IC50
nM
Kd
nM
EC50/IC50
nM
koff
s-1
kon
M-1s-1
pHTemp
°C
Serine/threonine-protein kinase Chk1
(Homo sapiens (Human))
BDBM50401619
(CHEMBL2204588)
Show SMILES CNc1cc(Nc2cnc(C#N)c(O[C@H](C)CN(C)C)n2)ncc1C1CC1 |r|
Show InChI InChI=1S/C19H25N7O/c1-12(11-26(3)4)27-19-16(8-20)22-10-18(25-19)24-17-7-15(21-2)14(9-23-17)13-5-6-13/h7,9-10,12-13H,5-6,11H2,1-4H3,(H2,21,23,24,25)/t12-/m1/s1
Reactome pathway
n/an/a 26n/an/an/an/an/an/a
Institute of Cancer Research
Curated by ChEMBL
Assay Description
Inhibition of CHK1 using 5-FAM-KKKVSRSGLYRSPSMPENLNRPR-COOH as substrate after 1 hr by microfluidic assay in presence of ATP
J Med Chem 55: 10229-40 (2012)
Article DOI: 10.1021/jm3012933
BindingDB Entry DOI: 10.7270/Q2N87BZM
Potassium voltage-gated channel subfamily H member 2
(Homo sapiens (Human))
BDBM50401619
(CHEMBL2204588)
Show SMILES CNc1cc(Nc2cnc(C#N)c(O[C@H](C)CN(C)C)n2)ncc1C1CC1 |r|
Show InChI InChI=1S/C19H25N7O/c1-12(11-26(3)4)27-19-16(8-20)22-10-18(25-19)24-17-7-15(21-2)14(9-23-17)13-5-6-13/h7,9-10,12-13H,5-6,11H2,1-4H3,(H2,21,23,24,25)/t12-/m1/s1
Reactome pathway
n/an/a 6.00E+3n/an/an/an/an/an/a
Institute of Cancer Research
Curated by ChEMBL
Assay Description
Inhibition of human ERG overexpressed in HEK cells
J Med Chem 55: 10229-40 (2012)
Article DOI: 10.1021/jm3012933
BindingDB Entry DOI: 10.7270/Q2N87BZM
Serine/threonine-protein kinase Chk1
(Homo sapiens (Human))
BDBM50401619
(CHEMBL2204588)
Show SMILES CNc1cc(Nc2cnc(C#N)c(O[C@H](C)CN(C)C)n2)ncc1C1CC1 |r|
Show InChI InChI=1S/C19H25N7O/c1-12(11-26(3)4)27-19-16(8-20)22-10-18(25-19)24-17-7-15(21-2)14(9-23-17)13-5-6-13/h7,9-10,12-13H,5-6,11H2,1-4H3,(H2,21,23,24,25)/t12-/m1/s1
Reactome pathway
n/an/a 10n/an/an/an/an/an/a
Institute of Cancer Research
Curated by ChEMBL
Assay Description
Inhibition of CHK1 in human HT-29 cells assessed as etoposide-induced G2 check point arrest after 21 hrs by ELISA
J Med Chem 55: 10229-40 (2012)
Article DOI: 10.1021/jm3012933
BindingDB Entry DOI: 10.7270/Q2N87BZM