BDBM50401676 CHEMBL2205915
SMILES: COc1ccc(cc1)-n1cnc2c(sc3ncnc(NC4CC4)c23)c1=O
InChI Key: InChIKey=DBUMITZHDMTTNX-UHFFFAOYSA-N
Data: 1 KI  2 IC50
Activity Spreadsheet -- Enzyme Inhibition Constant Data from BindingDB
Found 3 hits for monomerid = 50401676
Trg + Lig
Ki
nM
ΔG°
kcal/mole
IC50
nM
Kd
nM
EC50/IC50
nM
koff
s-1
kon
M-1s-1
pHTemp
°C
Metabotropic glutamate receptor
(RAT)
BDBM50401676
(CHEMBL2205915)
Show SMILES COc1ccc(cc1)-n1cnc2c(sc3ncnc(NC4CC4)c23)c1=O
Show InChI InChI=1S/C18H15N5O2S/c1-25-12-6-4-11(5-7-12)23-9-21-14-13-16(22-10-2-3-10)19-8-20-17(13)26-15(14)18(23)24/h4-10H,2-3H2,1H3,(H,19,20,22)
14.5n/an/an/an/an/an/an/an/a
Merck Research Laboratories
Curated by ChEMBL
Assay Description
Antagonist activity at rat mGluR1
Bioorg Med Chem Lett 22: 7223-6 (2012)
Article DOI: 10.1016/j.bmcl.2012.09.048
BindingDB Entry DOI: 10.7270/Q24B32GJ
Metabotropic glutamate receptor 1
(Homo sapiens (Human))
BDBM50401676
(CHEMBL2205915)
Show SMILES COc1ccc(cc1)-n1cnc2c(sc3ncnc(NC4CC4)c23)c1=O
Show InChI InChI=1S/C18H15N5O2S/c1-25-12-6-4-11(5-7-12)23-9-21-14-13-16(22-10-2-3-10)19-8-20-17(13)26-15(14)18(23)24/h4-10H,2-3H2,1H3,(H,19,20,22)
n/an/a 6n/an/an/an/an/an/a
Merck Research Laboratories
Curated by ChEMBL
Assay Description
Antagonist activity at human mGluR1
Bioorg Med Chem Lett 22: 7223-6 (2012)
Article DOI: 10.1016/j.bmcl.2012.09.048
BindingDB Entry DOI: 10.7270/Q24B32GJ
Metabotropic glutamate receptor 5
(Homo sapiens (Human))
BDBM50401676
(CHEMBL2205915)
Show SMILES COc1ccc(cc1)-n1cnc2c(sc3ncnc(NC4CC4)c23)c1=O
Show InChI InChI=1S/C18H15N5O2S/c1-25-12-6-4-11(5-7-12)23-9-21-14-13-16(22-10-2-3-10)19-8-20-17(13)26-15(14)18(23)24/h4-10H,2-3H2,1H3,(H,19,20,22)
n/an/a 1.00E+4n/an/an/an/an/an/a
Merck Research Laboratories
Curated by ChEMBL
Assay Description
Antagonist activity at human mGluR5
Bioorg Med Chem Lett 22: 7223-6 (2012)
Article DOI: 10.1016/j.bmcl.2012.09.048
BindingDB Entry DOI: 10.7270/Q24B32GJ