BDBM50401746 CHEMBL2207133
SMILES: C[C@H](NC(=O)CN)C(=O)N[C@@H](Cc1ccccc1)C(=O)OCC(O)=O
InChI Key: InChIKey=VQDVDJQYFIVYCL-JQWIXIFHSA-N
Data: 2 IC50
Activity Spreadsheet -- Enzyme Inhibition Constant Data from BindingDB
Found 2 hits for monomerid = 50401746
Trg + Lig
Ki
nM
ΔG°
kcal/mole
IC50
nM
Kd
nM
EC50/IC50
nM
koff
s-1
kon
M-1s-1
pHTemp
°C
Peptidyl-glycine alpha-amidating monooxygenase
(Homo sapiens (Human))
BDBM50401746
(CHEMBL2207133)
Show SMILES C[C@H](NC(=O)CN)C(=O)N[C@@H](Cc1ccccc1)C(=O)OCC(O)=O |r|
Show InChI InChI=1S/C16H21N3O6/c1-10(18-13(20)8-17)15(23)19-12(16(24)25-9-14(21)22)7-11-5-3-2-4-6-11/h2-6,10,12H,7-9,17H2,1H3,(H,18,20)(H,19,23)(H,21,22)/t10-,12-/m0/s1
n/an/a 5.60E+5n/an/an/an/an/an/a
Australian National University
Curated by ChEMBL
Assay Description
Competitive inhibition of PAM in human DMS53 cells using as(R)-Tyr-(S)-Val-Gly as substrate after 2 hrs by HPLC analysis
Bioorg Med Chem Lett 22: 7015-8 (2012)
Article DOI: 10.1016/j.bmcl.2012.10.004
BindingDB Entry DOI: 10.7270/Q2VT1T73
Peptidyl-glycine alpha-amidating monooxygenase
(Homo sapiens (Human))
BDBM50401746
(CHEMBL2207133)
Show SMILES C[C@H](NC(=O)CN)C(=O)N[C@@H](Cc1ccccc1)C(=O)OCC(O)=O |r|
Show InChI InChI=1S/C16H21N3O6/c1-10(18-13(20)8-17)15(23)19-12(16(24)25-9-14(21)22)7-11-5-3-2-4-6-11/h2-6,10,12H,7-9,17H2,1H3,(H,18,20)(H,19,23)(H,21,22)/t10-,12-/m0/s1
n/an/a 1.60E+5n/an/an/an/an/an/a
Australian National University
Curated by ChEMBL
Assay Description
Competitive inhibition of secreted PAM in human DMS53 cell culture medium using as(R)-Tyr-(S)-Val-Gly as substrate after 2 hrs by HPLC analysis
Bioorg Med Chem Lett 22: 7015-8 (2012)
Article DOI: 10.1016/j.bmcl.2012.10.004
BindingDB Entry DOI: 10.7270/Q2VT1T73