BDBM50401903 CHEMBL2207194
SMILES: O=C(NCCCNc1nc(Nc2cccc(Cn3cncn3)c2)ncc1C1CC1)C1CCC1
InChI Key: InChIKey=GDYSINUURRPNLP-UHFFFAOYSA-N
Data: 2 IC50
Activity Spreadsheet -- Enzyme Inhibition Constant Data from BindingDB
Found 2 hits for monomerid = 50401903
Trg + Lig
Ki
nM
ΔG°
kcal/mole
IC50
nM
Kd
nM
EC50/IC50
nM
koff
s-1
kon
M-1s-1
pHTemp
°C
Protein cereblon/Serine/threonine-protein kinase TBK1
(Homo sapiens (Human))
BDBM50401903
(CHEMBL2207194)
Show SMILES O=C(NCCCNc1nc(Nc2cccc(Cn3cncn3)c2)ncc1C1CC1)C1CCC1
Show InChI InChI=1S/C24H30N8O/c33-23(19-5-2-6-19)27-11-3-10-26-22-21(18-8-9-18)13-28-24(31-22)30-20-7-1-4-17(12-20)14-32-16-25-15-29-32/h1,4,7,12-13,15-16,18-19H,2-3,5-6,8-11,14H2,(H,27,33)(H2,26,28,30,31)
n/an/a 3n/an/an/an/an/an/a
MRC Technology
Curated by ChEMBL
Assay Description
Inhibition of TBK1 by radiometry
Bioorg Med Chem Lett 22: 7169-73 (2012)
Article DOI: 10.1016/j.bmcl.2012.09.063
BindingDB Entry DOI: 10.7270/Q2TT4S45
Serine/threonine-protein kinase TBK1
(Mus musculus)
BDBM50401903
(CHEMBL2207194)
Show SMILES O=C(NCCCNc1nc(Nc2cccc(Cn3cncn3)c2)ncc1C1CC1)C1CCC1
Show InChI InChI=1S/C24H30N8O/c33-23(19-5-2-6-19)27-11-3-10-26-22-21(18-8-9-18)13-28-24(31-22)30-20-7-1-4-17(12-20)14-32-16-25-15-29-32/h1,4,7,12-13,15-16,18-19H,2-3,5-6,8-11,14H2,(H,27,33)(H2,26,28,30,31)
Reactome pathway
n/an/a 88n/an/an/an/an/an/a
MRC Technology
Curated by ChEMBL
Assay Description
Inhibition of TBK1-mediated RANTES release in LPS-stimulated mouse RAW264.7 cells compound incubated for 30 mins prior LPS challenge measured after 6...
Bioorg Med Chem Lett 22: 7169-73 (2012)
Article DOI: 10.1016/j.bmcl.2012.09.063
BindingDB Entry DOI: 10.7270/Q2TT4S45