BDBM50401905 CHEMBL2207192
SMILES: O=C(NCCCNc1nc(Nc2cccc(c2)-c2cnco2)ncc1C1CC1)C1CCC1
InChI Key: InChIKey=DHEGBWHMLXDRTE-UHFFFAOYSA-N
Data: 2 IC50
Activity Spreadsheet -- Enzyme Inhibition Constant Data from BindingDB
Found 2 hits for monomerid = 50401905
Trg + Lig
Ki
nM
ΔG°
kcal/mole
IC50
nM
Kd
nM
EC50/IC50
nM
koff
s-1
kon
M-1s-1
pHTemp
°C
Protein cereblon/Serine/threonine-protein kinase TBK1
(Homo sapiens (Human))
BDBM50401905
(CHEMBL2207192)
Show SMILES O=C(NCCCNc1nc(Nc2cccc(c2)-c2cnco2)ncc1C1CC1)C1CCC1
Show InChI InChI=1S/C24H28N6O2/c31-23(17-4-1-5-17)27-11-3-10-26-22-20(16-8-9-16)13-28-24(30-22)29-19-7-2-6-18(12-19)21-14-25-15-32-21/h2,6-7,12-17H,1,3-5,8-11H2,(H,27,31)(H2,26,28,29,30)
n/an/a 11n/an/an/an/an/an/a
MRC Technology
Curated by ChEMBL
Assay Description
Inhibition of TBK1 by radiometry
Bioorg Med Chem Lett 22: 7169-73 (2012)
Article DOI: 10.1016/j.bmcl.2012.09.063
BindingDB Entry DOI: 10.7270/Q2TT4S45
Serine/threonine-protein kinase TBK1
(Mus musculus)
BDBM50401905
(CHEMBL2207192)
Show SMILES O=C(NCCCNc1nc(Nc2cccc(c2)-c2cnco2)ncc1C1CC1)C1CCC1
Show InChI InChI=1S/C24H28N6O2/c31-23(17-4-1-5-17)27-11-3-10-26-22-20(16-8-9-16)13-28-24(30-22)29-19-7-2-6-18(12-19)21-14-25-15-32-21/h2,6-7,12-17H,1,3-5,8-11H2,(H,27,31)(H2,26,28,29,30)
Reactome pathway
n/an/a 560n/an/an/an/an/an/a
MRC Technology
Curated by ChEMBL
Assay Description
Inhibition of TBK1-mediated RANTES release in LPS-stimulated mouse RAW264.7 cells compound incubated for 30 mins prior LPS challenge measured after 6...
Bioorg Med Chem Lett 22: 7169-73 (2012)
Article DOI: 10.1016/j.bmcl.2012.09.063
BindingDB Entry DOI: 10.7270/Q2TT4S45