BDBM50401913 CHEMBL2207214
SMILES: O=C(NCCCNc1nc(Nc2cnn(c2)C2CCOCC2)ncc1C1CC1)C1CCC1
InChI Key: InChIKey=BPUHLRZXPRJIDO-UHFFFAOYSA-N
Data: 2 IC50
Activity Spreadsheet -- Enzyme Inhibition Constant Data from BindingDB
Found 2 hits for monomerid = 50401913
Trg + Lig
Ki
nM
ΔG°
kcal/mole
IC50
nM
Kd
nM
EC50/IC50
nM
koff
s-1
kon
M-1s-1
pHTemp
°C
Serine/threonine-protein kinase TBK1
(Mus musculus)
BDBM50401913
(CHEMBL2207214)
Show SMILES O=C(NCCCNc1nc(Nc2cnn(c2)C2CCOCC2)ncc1C1CC1)C1CCC1
Show InChI InChI=1S/C23H33N7O2/c31-22(17-3-1-4-17)25-10-2-9-24-21-20(16-5-6-16)14-26-23(29-21)28-18-13-27-30(15-18)19-7-11-32-12-8-19/h13-17,19H,1-12H2,(H,25,31)(H2,24,26,28,29)
Reactome pathway
n/an/a 280n/an/an/an/an/an/a
MRC Technology
Curated by ChEMBL
Assay Description
Inhibition of TBK1-mediated RANTES release in LPS-stimulated mouse RAW264.7 cells compound incubated for 30 mins prior LPS challenge measured after 6...
Bioorg Med Chem Lett 22: 7169-73 (2012)
Article DOI: 10.1016/j.bmcl.2012.09.063
BindingDB Entry DOI: 10.7270/Q2TT4S45
Protein cereblon/Serine/threonine-protein kinase TBK1
(Homo sapiens (Human))
BDBM50401913
(CHEMBL2207214)
Show SMILES O=C(NCCCNc1nc(Nc2cnn(c2)C2CCOCC2)ncc1C1CC1)C1CCC1
Show InChI InChI=1S/C23H33N7O2/c31-22(17-3-1-4-17)25-10-2-9-24-21-20(16-5-6-16)14-26-23(29-21)28-18-13-27-30(15-18)19-7-11-32-12-8-19/h13-17,19H,1-12H2,(H,25,31)(H2,24,26,28,29)
n/an/a 2n/an/an/an/an/an/a
MRC Technology
Curated by ChEMBL
Assay Description
Inhibition of TBK1 by radiometry
Bioorg Med Chem Lett 22: 7169-73 (2012)
Article DOI: 10.1016/j.bmcl.2012.09.063
BindingDB Entry DOI: 10.7270/Q2TT4S45