BDBM50401921 CHEMBL2207205
SMILES: Cn1ncc2cc(Nc3ncc(C4CC4)c(NCCCNC(=O)C4CCC4)n3)ccc12
InChI Key: InChIKey=ZWBYSALZHQDDEL-UHFFFAOYSA-N
Data: 2 IC50
Activity Spreadsheet -- Enzyme Inhibition Constant Data from BindingDB
Found 2 hits for monomerid = 50401921
Trg + Lig
Ki
nM
ΔG°
kcal/mole
IC50
nM
Kd
nM
EC50/IC50
nM
koff
s-1
kon
M-1s-1
pHTemp
°C
Serine/threonine-protein kinase TBK1
(Mus musculus)
BDBM50401921
(CHEMBL2207205)
Show SMILES Cn1ncc2cc(Nc3ncc(C4CC4)c(NCCCNC(=O)C4CCC4)n3)ccc12
Show InChI InChI=1S/C23H29N7O/c1-30-20-9-8-18(12-17(20)13-27-30)28-23-26-14-19(15-6-7-15)21(29-23)24-10-3-11-25-22(31)16-4-2-5-16/h8-9,12-16H,2-7,10-11H2,1H3,(H,25,31)(H2,24,26,28,29)
Reactome pathway
n/an/a 380n/an/an/an/an/an/a
MRC Technology
Curated by ChEMBL
Assay Description
Inhibition of TBK1-mediated RANTES release in LPS-stimulated mouse RAW264.7 cells compound incubated for 30 mins prior LPS challenge measured after 6...
Bioorg Med Chem Lett 22: 7169-73 (2012)
Article DOI: 10.1016/j.bmcl.2012.09.063
BindingDB Entry DOI: 10.7270/Q2TT4S45
Protein cereblon/Serine/threonine-protein kinase TBK1
(Homo sapiens (Human))
BDBM50401921
(CHEMBL2207205)
Show SMILES Cn1ncc2cc(Nc3ncc(C4CC4)c(NCCCNC(=O)C4CCC4)n3)ccc12
Show InChI InChI=1S/C23H29N7O/c1-30-20-9-8-18(12-17(20)13-27-30)28-23-26-14-19(15-6-7-15)21(29-23)24-10-3-11-25-22(31)16-4-2-5-16/h8-9,12-16H,2-7,10-11H2,1H3,(H,25,31)(H2,24,26,28,29)
n/an/a 16n/an/an/an/an/an/a
MRC Technology
Curated by ChEMBL
Assay Description
Inhibition of TBK1 by radiometry
Bioorg Med Chem Lett 22: 7169-73 (2012)
Article DOI: 10.1016/j.bmcl.2012.09.063
BindingDB Entry DOI: 10.7270/Q2TT4S45