BDBM50401922 CHEMBL2207204
SMILES: O=C(NCCCNc1nc(Nc2ccc3CCN(Cc3c2)C2CC2)ncc1C1CC1)C1CCC1
InChI Key: InChIKey=MDSQSUYVBCKIKT-UHFFFAOYSA-N
Data: 2 IC50
Activity Spreadsheet -- Enzyme Inhibition Constant Data from BindingDB
Found 2 hits for monomerid = 50401922
Trg + Lig
Ki
nM
ΔG°
kcal/mole
IC50
nM
Kd
nM
EC50/IC50
nM
koff
s-1
kon
M-1s-1
pHTemp
°C
Serine/threonine-protein kinase TBK1
(Mus musculus)
BDBM50401922
(CHEMBL2207204)
Show SMILES O=C(NCCCNc1nc(Nc2ccc3CCN(Cc3c2)C2CC2)ncc1C1CC1)C1CCC1
Show InChI InChI=1S/C27H36N6O/c34-26(20-3-1-4-20)29-13-2-12-28-25-24(19-5-6-19)16-30-27(32-25)31-22-8-7-18-11-14-33(23-9-10-23)17-21(18)15-22/h7-8,15-16,19-20,23H,1-6,9-14,17H2,(H,29,34)(H2,28,30,31,32)
Reactome pathway
n/an/a 570n/an/an/an/an/an/a
MRC Technology
Curated by ChEMBL
Assay Description
Inhibition of TBK1-mediated RANTES release in LPS-stimulated mouse RAW264.7 cells compound incubated for 30 mins prior LPS challenge measured after 6...
Bioorg Med Chem Lett 22: 7169-73 (2012)
Article DOI: 10.1016/j.bmcl.2012.09.063
BindingDB Entry DOI: 10.7270/Q2TT4S45
Protein cereblon/Serine/threonine-protein kinase TBK1
(Homo sapiens (Human))
BDBM50401922
(CHEMBL2207204)
Show SMILES O=C(NCCCNc1nc(Nc2ccc3CCN(Cc3c2)C2CC2)ncc1C1CC1)C1CCC1
Show InChI InChI=1S/C27H36N6O/c34-26(20-3-1-4-20)29-13-2-12-28-25-24(19-5-6-19)16-30-27(32-25)31-22-8-7-18-11-14-33(23-9-10-23)17-21(18)15-22/h7-8,15-16,19-20,23H,1-6,9-14,17H2,(H,29,34)(H2,28,30,31,32)
n/an/a 7n/an/an/an/an/an/a
MRC Technology
Curated by ChEMBL
Assay Description
Inhibition of TBK1 by radiometry
Bioorg Med Chem Lett 22: 7169-73 (2012)
Article DOI: 10.1016/j.bmcl.2012.09.063
BindingDB Entry DOI: 10.7270/Q2TT4S45