BDBM50401926 CHEMBL2207200
SMILES: O=C(NCCCNc1nc(Nc2cccnc2)ncc1C1CC1)C1CCC1
InChI Key: InChIKey=DAAZPAUBEVGXFD-UHFFFAOYSA-N
Data: 2 IC50
Activity Spreadsheet -- Enzyme Inhibition Constant Data from BindingDB
Found 2 hits for monomerid = 50401926
Trg + Lig
Ki
nM
ΔG°
kcal/mole
IC50
nM
Kd
nM
EC50/IC50
nM
koff
s-1
kon
M-1s-1
pHTemp
°C
Serine/threonine-protein kinase TBK1
(Mus musculus)
BDBM50401926
(CHEMBL2207200)
Show SMILES O=C(NCCCNc1nc(Nc2cccnc2)ncc1C1CC1)C1CCC1
Show InChI InChI=1S/C20H26N6O/c27-19(15-4-1-5-15)23-11-3-10-22-18-17(14-7-8-14)13-24-20(26-18)25-16-6-2-9-21-12-16/h2,6,9,12-15H,1,3-5,7-8,10-11H2,(H,23,27)(H2,22,24,25,26)
Reactome pathway
n/an/a>1.00E+3n/an/an/an/an/an/a
MRC Technology
Curated by ChEMBL
Assay Description
Inhibition of TBK1-mediated RANTES release in LPS-stimulated mouse RAW264.7 cells compound incubated for 30 mins prior LPS challenge measured after 6...
Bioorg Med Chem Lett 22: 7169-73 (2012)
Article DOI: 10.1016/j.bmcl.2012.09.063
BindingDB Entry DOI: 10.7270/Q2TT4S45
Protein cereblon/Serine/threonine-protein kinase TBK1
(Homo sapiens (Human))
BDBM50401926
(CHEMBL2207200)
Show SMILES O=C(NCCCNc1nc(Nc2cccnc2)ncc1C1CC1)C1CCC1
Show InChI InChI=1S/C20H26N6O/c27-19(15-4-1-5-15)23-11-3-10-22-18-17(14-7-8-14)13-24-20(26-18)25-16-6-2-9-21-12-16/h2,6,9,12-15H,1,3-5,7-8,10-11H2,(H,23,27)(H2,22,24,25,26)
n/an/a 13n/an/an/an/an/an/a
MRC Technology
Curated by ChEMBL
Assay Description
Inhibition of TBK1 by radiometry
Bioorg Med Chem Lett 22: 7169-73 (2012)
Article DOI: 10.1016/j.bmcl.2012.09.063
BindingDB Entry DOI: 10.7270/Q2TT4S45