BDBM50401969 CHEMBL2207957
SMILES: COc1ccc2N3C(Sc2c1)=NC(=C\C3=C/C#N)c1ccccc1
InChI Key: InChIKey=HYCBLXCSWDXOFK-NTEUORMPSA-N
Data: 2 IC50
Activity Spreadsheet -- Enzyme Inhibition Constant Data from BindingDB
Found 2 hits for monomerid = 50401969
Trg + Lig
Ki
nM
ΔG°
kcal/mole
IC50
nM
Kd
nM
EC50/IC50
nM
koff
s-1
kon
M-1s-1
pHTemp
°C
alpha-glucosidase (Gaa)
(Mus musculus (Mouse))
BDBM50401969
(CHEMBL2207957)
Show SMILES COc1ccc2N3C(Sc2c1)=NC(=C\C3=C/C#N)c1ccccc1 |c:12,14|
Show InChI InChI=1S/C19H13N3OS/c1-23-15-7-8-17-18(12-15)24-19-21-16(13-5-3-2-4-6-13)11-14(9-10-20)22(17)19/h2-9,11-12H,1H3/b14-9+
n/an/a 2.50E+4n/an/an/an/an/an/a
North Maharashtra University
Curated by ChEMBL
Assay Description
Inhibition of liver glucosidase in Swiss mouse liver extracts
Bioorg Med Chem Lett 22: 7011-4 (2012)
Article DOI: 10.1016/j.bmcl.2012.10.025
BindingDB Entry DOI: 10.7270/Q2FN17CD
Pancreatic alpha-amylase
(Sus scrofa (Pig))
BDBM50401969
(CHEMBL2207957)
Show SMILES COc1ccc2N3C(Sc2c1)=NC(=C\C3=C/C#N)c1ccccc1 |c:12,14|
Show InChI InChI=1S/C19H13N3OS/c1-23-15-7-8-17-18(12-15)24-19-21-16(13-5-3-2-4-6-13)11-14(9-10-20)22(17)19/h2-9,11-12H,1H3/b14-9+
n/an/a 2.23E+4n/an/an/an/an/an/a
North Maharashtra University
Curated by ChEMBL
Assay Description
Inhibition of porcine pancreatic alpha amylase using starch as substrate by Bernfeld method
Bioorg Med Chem Lett 22: 7011-4 (2012)
Article DOI: 10.1016/j.bmcl.2012.10.025
BindingDB Entry DOI: 10.7270/Q2FN17CD