BDBM50402089 CHEMBL2206611
SMILES: N#CCCN1CCC(CC1)n1c(nc2cnc3[nH]ccc3c12)C1CCC1
InChI Key: InChIKey=OCIRMEXSJHOKRZ-UHFFFAOYSA-N
Data: 1 KI  1 EC50
Activity Spreadsheet -- Enzyme Inhibition Constant Data from BindingDB
Found 2 hits for monomerid = 50402089
Trg + Lig
Ki
nM
ΔG°
kcal/mole
IC50
nM
Kd
nM
EC50/IC50
nM
koff
s-1
kon
M-1s-1
pHTemp
°C
Tyrosine-protein kinase JAK1
(Homo sapiens (Human))
BDBM50402089
(CHEMBL2206611)
Show SMILES N#CCCN1CCC(CC1)n1c(nc2cnc3[nH]ccc3c12)C1CCC1
Show InChI InChI=1S/C20H24N6/c21-8-2-10-25-11-6-15(7-12-25)26-18-16-5-9-22-19(16)23-13-17(18)24-20(26)14-3-1-4-14/h5,9,13-15H,1-4,6-7,10-12H2,(H,22,23)
Reactome pathway
4.30n/an/an/an/an/an/an/an/a
Genentech
Curated by ChEMBL
Assay Description
Inhibition of JAK1 kinase domain assessed as phosphorylation of N-terminal 5-carboxyfluorescein-tagged Val-Ala-Leu-Val-Asp-Gly-Tyr-Phe-Arg-Leu-Thr-Th...
Bioorg Med Chem Lett 22: 7627-33 (2012)
Article DOI: 10.1016/j.bmcl.2012.10.008
BindingDB Entry DOI: 10.7270/Q2P55PPP
Tyrosine-protein kinase JAK1
(Homo sapiens (Human))
BDBM50402089
(CHEMBL2206611)
Show SMILES N#CCCN1CCC(CC1)n1c(nc2cnc3[nH]ccc3c12)C1CCC1
Show InChI InChI=1S/C20H24N6/c21-8-2-10-25-11-6-15(7-12-25)26-18-16-5-9-22-19(16)23-13-17(18)24-20(26)14-3-1-4-14/h5,9,13-15H,1-4,6-7,10-12H2,(H,22,23)
Reactome pathway
n/an/an/an/a 430n/an/an/an/a
Genentech
Curated by ChEMBL
Assay Description
Inhibition of JAK1 in human TF1 cells assessed as inhibition of IL6-induced STAT3 phosphorylation incubated for 20 mins prior to IL6-induction measur...
Bioorg Med Chem Lett 22: 7627-33 (2012)
Article DOI: 10.1016/j.bmcl.2012.10.008
BindingDB Entry DOI: 10.7270/Q2P55PPP