BDBM50402125 CHEMBL2207276
SMILES: Cc1cc(Cl)ccc1OC1CCN(C[C@H](O)CNC(=O)c2c[nH]c(=O)c3cc(ccc23)S(C)(=O)=O)CC1
InChI Key: InChIKey=FEIOPVQTLJUJBR-GOSISDBHSA-N
Data: 2 KI  1 IC50
Activity Spreadsheet -- Enzyme Inhibition Constant Data from BindingDB
Found 3 hits for monomerid = 50402125
Trg + Lig
Ki
nM
ΔG°
kcal/mole
IC50
nM
Kd
nM
EC50/IC50
nM
koff
s-1
kon
M-1s-1
pHTemp
°C
C-C chemokine receptor type 3
(Homo sapiens (Human))
BDBM50402125
(CHEMBL2207276)
Show SMILES Cc1cc(Cl)ccc1OC1CCN(C[C@H](O)CNC(=O)c2c[nH]c(=O)c3cc(ccc23)S(C)(=O)=O)CC1 |r|
Show InChI InChI=1S/C26H30ClN3O6S/c1-16-11-17(27)3-6-24(16)36-19-7-9-30(10-8-19)15-18(31)13-28-26(33)23-14-29-25(32)22-12-20(37(2,34)35)4-5-21(22)23/h3-6,11-12,14,18-19,31H,7-10,13,15H2,1-2H3,(H,28,33)(H,29,32)/t18-/m1/s1
Reactome pathway
15.8n/an/an/an/an/an/an/an/a
AstraZeneca
Curated by ChEMBL
Assay Description
Displacement of [3H]-4-(2,4-dichloro-3-methylphenoxy)-l'-[4-(methylsulfonyl)benzoyl]-l,4'-bipiperidine from human recombinant CCR3 expressed in CHOK1...
Bioorg Med Chem Lett 22: 7707-10 (2012)
Article DOI: 10.1016/j.bmcl.2012.09.112
BindingDB Entry DOI: 10.7270/Q2JD4XZZ
Histamine H1 receptor
(Homo sapiens (Human))
BDBM50402125
(CHEMBL2207276)
Show SMILES Cc1cc(Cl)ccc1OC1CCN(C[C@H](O)CNC(=O)c2c[nH]c(=O)c3cc(ccc23)S(C)(=O)=O)CC1 |r|
Show InChI InChI=1S/C26H30ClN3O6S/c1-16-11-17(27)3-6-24(16)36-19-7-9-30(10-8-19)15-18(31)13-28-26(33)23-14-29-25(32)22-12-20(37(2,34)35)4-5-21(22)23/h3-6,11-12,14,18-19,31H,7-10,13,15H2,1-2H3,(H,28,33)(H,29,32)/t18-/m1/s1
Reactome pathway
79.4n/an/an/an/an/an/an/an/a
AstraZeneca
Curated by ChEMBL
Assay Description
Displacement of [3H]-pyrilamine from human recombinant H1 histamine receptor expressed in CHOK1 cells after 1 hr
Bioorg Med Chem Lett 22: 7707-10 (2012)
Article DOI: 10.1016/j.bmcl.2012.09.112
BindingDB Entry DOI: 10.7270/Q2JD4XZZ
Potassium voltage-gated channel subfamily H member 2
(Homo sapiens (Human))
BDBM50402125
(CHEMBL2207276)
Show SMILES Cc1cc(Cl)ccc1OC1CCN(C[C@H](O)CNC(=O)c2c[nH]c(=O)c3cc(ccc23)S(C)(=O)=O)CC1 |r|
Show InChI InChI=1S/C26H30ClN3O6S/c1-16-11-17(27)3-6-24(16)36-19-7-9-30(10-8-19)15-18(31)13-28-26(33)23-14-29-25(32)22-12-20(37(2,34)35)4-5-21(22)23/h3-6,11-12,14,18-19,31H,7-10,13,15H2,1-2H3,(H,28,33)(H,29,32)/t18-/m1/s1
Reactome pathway
n/an/a 2.00E+3n/an/an/an/an/an/a
AstraZeneca
Curated by ChEMBL
Assay Description
Displacement of 3,7-Bis[2-(4-nitro[3,5]-[3H]phenyl)ethyl]-3,7-diazabicyclo[3.3.1]nonane from human ERG expressed in HEK cells after 3hrs
Bioorg Med Chem Lett 22: 7707-10 (2012)
Article DOI: 10.1016/j.bmcl.2012.09.112
BindingDB Entry DOI: 10.7270/Q2JD4XZZ