BDBM50402153 CHEMBL2208001
SMILES: Cc1csc(n1)-c1[nH]c(nc1-c1ccc2ncsc2c1)C1CCOCC1
InChI Key: InChIKey=DLQZDLJWNOCYMU-UHFFFAOYSA-N
Data: 2 IC50
Activity Spreadsheet -- Enzyme Inhibition Constant Data from BindingDB
Found 2 hits for monomerid = 50402153
Trg + Lig
Ki
nM
ΔG°
kcal/mole
IC50
nM
Kd
nM
EC50/IC50
nM
koff
s-1
kon
M-1s-1
pHTemp
°C
TGF-beta receptor type-1
(Homo sapiens (Human))
BDBM50402153
(CHEMBL2208001)
Show SMILES Cc1csc(n1)-c1[nH]c(nc1-c1ccc2ncsc2c1)C1CCOCC1
Show InChI InChI=1S/C19H18N4OS2/c1-11-9-25-19(21-11)17-16(13-2-3-14-15(8-13)26-10-20-14)22-18(23-17)12-4-6-24-7-5-12/h2-3,8-10,12H,4-7H2,1H3,(H,22,23)
n/an/a 21n/an/an/an/an/an/a
Taisho Pharmaceutical Co., Ltd
Curated by ChEMBL
Assay Description
Inhibition of human ALK5 using GST-tagged Smad3 as substrate assessed as substrate phosphorylation after 30 mins by ELISA
Bioorg Med Chem 20: 7128-38 (2012)
Article DOI: 10.1016/j.bmc.2012.09.066
BindingDB Entry DOI: 10.7270/Q2542PQ0
TGF-beta receptor type-1
(Homo sapiens (Human))
BDBM50402153
(CHEMBL2208001)
Show SMILES Cc1csc(n1)-c1[nH]c(nc1-c1ccc2ncsc2c1)C1CCOCC1
Show InChI InChI=1S/C19H18N4OS2/c1-11-9-25-19(21-11)17-16(13-2-3-14-15(8-13)26-10-20-14)22-18(23-17)12-4-6-24-7-5-12/h2-3,8-10,12H,4-7H2,1H3,(H,22,23)
n/an/a 99n/an/an/an/an/an/a
Taisho Pharmaceutical Co., Ltd
Curated by ChEMBL
Assay Description
Inhibition of ALK5-mediated TNFalpha-induced Smad2/3 phosphorylation in human A549 cells preincubated for 2 hrs before addition of TNFalpha after 1 h...
Bioorg Med Chem 20: 7128-38 (2012)
Article DOI: 10.1016/j.bmc.2012.09.066
BindingDB Entry DOI: 10.7270/Q2542PQ0