BDBM50402155 CHEMBL2207999
SMILES: Cc1csc(n1)-c1[nH]c(nc1-c1ccc2ncsc2c1)C1CCCCC1
InChI Key: InChIKey=HVDUBOHDVHTDQL-UHFFFAOYSA-N
Data: 2 IC50
Activity Spreadsheet -- Enzyme Inhibition Constant Data from BindingDB
Found 2 hits for monomerid = 50402155
Trg + Lig
Ki
nM
ΔG°
kcal/mole
IC50
nM
Kd
nM
EC50/IC50
nM
koff
s-1
kon
M-1s-1
pHTemp
°C
TGF-beta receptor type-1
(Homo sapiens (Human))
BDBM50402155
(CHEMBL2207999)
Show SMILES Cc1csc(n1)-c1[nH]c(nc1-c1ccc2ncsc2c1)C1CCCCC1
Show InChI InChI=1S/C20H20N4S2/c1-12-10-25-20(22-12)18-17(14-7-8-15-16(9-14)26-11-21-15)23-19(24-18)13-5-3-2-4-6-13/h7-11,13H,2-6H2,1H3,(H,23,24)
n/an/a 12n/an/an/an/an/an/a
Taisho Pharmaceutical Co., Ltd
Curated by ChEMBL
Assay Description
Inhibition of human ALK5 using GST-tagged Smad3 as substrate assessed as substrate phosphorylation after 30 mins by ELISA
Bioorg Med Chem 20: 7128-38 (2012)
Article DOI: 10.1016/j.bmc.2012.09.066
BindingDB Entry DOI: 10.7270/Q2542PQ0
TGF-beta receptor type-1
(Homo sapiens (Human))
BDBM50402155
(CHEMBL2207999)
Show SMILES Cc1csc(n1)-c1[nH]c(nc1-c1ccc2ncsc2c1)C1CCCCC1
Show InChI InChI=1S/C20H20N4S2/c1-12-10-25-20(22-12)18-17(14-7-8-15-16(9-14)26-11-21-15)23-19(24-18)13-5-3-2-4-6-13/h7-11,13H,2-6H2,1H3,(H,23,24)
n/an/a 75n/an/an/an/an/an/a
Taisho Pharmaceutical Co., Ltd
Curated by ChEMBL
Assay Description
Inhibition of ALK5-mediated TNFalpha-induced Smad2/3 phosphorylation in human A549 cells preincubated for 2 hrs before addition of TNFalpha after 1 h...
Bioorg Med Chem 20: 7128-38 (2012)
Article DOI: 10.1016/j.bmc.2012.09.066
BindingDB Entry DOI: 10.7270/Q2542PQ0