BDBM50402157 CHEMBL2207997
SMILES: Cc1csc(n1)-c1[nH]c(nc1-c1ccc2ncsc2c1)C1CC1
InChI Key: InChIKey=BUXDPQTXABVEEX-UHFFFAOYSA-N
Data: 2 IC50
Activity Spreadsheet -- Enzyme Inhibition Constant Data from BindingDB
Found 2 hits for monomerid = 50402157
Trg + Lig
Ki
nM
ΔG°
kcal/mole
IC50
nM
Kd
nM
EC50/IC50
nM
koff
s-1
kon
M-1s-1
pHTemp
°C
TGF-beta receptor type-1
(Homo sapiens (Human))
BDBM50402157
(CHEMBL2207997)
Show SMILES Cc1csc(n1)-c1[nH]c(nc1-c1ccc2ncsc2c1)C1CC1
Show InChI InChI=1S/C17H14N4S2/c1-9-7-22-17(19-9)15-14(20-16(21-15)10-2-3-10)11-4-5-12-13(6-11)23-8-18-12/h4-8,10H,2-3H2,1H3,(H,20,21)
n/an/a 8.80n/an/an/an/an/an/a
Taisho Pharmaceutical Co., Ltd
Curated by ChEMBL
Assay Description
Inhibition of human ALK5 using GST-tagged Smad3 as substrate assessed as substrate phosphorylation after 30 mins by ELISA
Bioorg Med Chem 20: 7128-38 (2012)
Article DOI: 10.1016/j.bmc.2012.09.066
BindingDB Entry DOI: 10.7270/Q2542PQ0
TGF-beta receptor type-1
(Homo sapiens (Human))
BDBM50402157
(CHEMBL2207997)
Show SMILES Cc1csc(n1)-c1[nH]c(nc1-c1ccc2ncsc2c1)C1CC1
Show InChI InChI=1S/C17H14N4S2/c1-9-7-22-17(19-9)15-14(20-16(21-15)10-2-3-10)11-4-5-12-13(6-11)23-8-18-12/h4-8,10H,2-3H2,1H3,(H,20,21)
n/an/a 45n/an/an/an/an/an/a
Taisho Pharmaceutical Co., Ltd
Curated by ChEMBL
Assay Description
Inhibition of ALK5-mediated TNFalpha-induced Smad2/3 phosphorylation in human A549 cells preincubated for 2 hrs before addition of TNFalpha after 1 h...
Bioorg Med Chem 20: 7128-38 (2012)
Article DOI: 10.1016/j.bmc.2012.09.066
BindingDB Entry DOI: 10.7270/Q2542PQ0