BDBM50402344 CHEMBL2203321
SMILES: FC(F)(F)c1ccc(NC(=O)Nc2cccc(Oc3ccc4nccn4n3)c2)cc1
InChI Key: InChIKey=JSYFYBXDIWICOP-UHFFFAOYSA-N
Data: 1 IC50
Activity Spreadsheet -- Enzyme Inhibition Constant Data from BindingDB
Found 1 hit for monomerid = 50402344
Trg + Lig
Ki
nM
ΔG°
kcal/mole
IC50
nM
Kd
nM
EC50/IC50
nM
koff
s-1
kon
M-1s-1
pHTemp
°C
Vascular endothelial growth factor receptor 2
(Homo sapiens (Human))
BDBM50402344
(CHEMBL2203321)
Show SMILES FC(F)(F)c1ccc(NC(=O)Nc2cccc(Oc3ccc4nccn4n3)c2)cc1
Show InChI InChI=1S/C20H14F3N5O2/c21-20(22,23)13-4-6-14(7-5-13)25-19(29)26-15-2-1-3-16(12-15)30-18-9-8-17-24-10-11-28(17)27-18/h1-12H,(H2,25,26,29)
NCI pathway
Reactome pathway
n/an/a 29n/an/an/an/an/an/a
Takeda Pharmaceutical Company Limited
Curated by ChEMBL
Assay Description
Inhibition of human VEGFR2 for 5 mins prior to addition of 10 uM ATP using poly-GluTyr by AlphaScreen analysis
Bioorg Med Chem 20: 7051-8 (2012)
Article DOI: 10.1016/j.bmc.2012.10.004
BindingDB Entry DOI: 10.7270/Q2GF0VN9