BDBM50402410 CHEMBL2207760
SMILES: CCN1CCC[C@@H]1C(=O)Nc1ccc(cc1)-c1ccnc(Nc2ccc(cc2)N2CCOCC2)n1
InChI Key: InChIKey=HKCCVEZCHYRSPJ-RUZDIDTESA-N
Data: 4 IC50
Activity Spreadsheet -- Enzyme Inhibition Constant Data from BindingDB
Found 4 hits for monomerid = 50402410
Trg + Lig
Ki
nM
ΔG°
kcal/mole
IC50
nM
Kd
nM
EC50/IC50
nM
koff
s-1
kon
M-1s-1
pHTemp
°C
Tyrosine-protein kinase JAK2
(Homo sapiens (Human))
BDBM50402410
(CHEMBL2207760)
Show SMILES CCN1CCC[C@@H]1C(=O)Nc1ccc(cc1)-c1ccnc(Nc2ccc(cc2)N2CCOCC2)n1 |r|
Show InChI InChI=1S/C27H32N6O2/c1-2-32-15-3-4-25(32)26(34)29-21-7-5-20(6-8-21)24-13-14-28-27(31-24)30-22-9-11-23(12-10-22)33-16-18-35-19-17-33/h5-14,25H,2-4,15-19H2,1H3,(H,29,34)(H,28,30,31)/t25-/m1/s1
Reactome pathway
n/an/a 2.17E+3n/an/an/an/an/an/a
Exelixis
Curated by ChEMBL
Assay Description
Inhibition of JAK2 in HEL 92.1.7 cells assessed as inhibition of STAT3 phosphorylation
Bioorg Med Chem Lett 22: 7653-8 (2012)
Article DOI: 10.1016/j.bmcl.2012.10.007
BindingDB Entry DOI: 10.7270/Q2PZ59ZN
Tyrosine-protein kinase JAK2
(Homo sapiens (Human))
BDBM50402410
(CHEMBL2207760)
Show SMILES CCN1CCC[C@@H]1C(=O)Nc1ccc(cc1)-c1ccnc(Nc2ccc(cc2)N2CCOCC2)n1 |r|
Show InChI InChI=1S/C27H32N6O2/c1-2-32-15-3-4-25(32)26(34)29-21-7-5-20(6-8-21)24-13-14-28-27(31-24)30-22-9-11-23(12-10-22)33-16-18-35-19-17-33/h5-14,25H,2-4,15-19H2,1H3,(H,29,34)(H,28,30,31)/t25-/m1/s1
Reactome pathway
n/an/a 9.10n/an/an/an/an/an/a
Exelixis
Curated by ChEMBL
Assay Description
Inhibition of JAK2
Bioorg Med Chem Lett 22: 7653-8 (2012)
Article DOI: 10.1016/j.bmcl.2012.10.007
BindingDB Entry DOI: 10.7270/Q2PZ59ZN
Tyrosine-protein kinase JAK3
(Homo sapiens (Human))
BDBM50402410
(CHEMBL2207760)
Show SMILES CCN1CCC[C@@H]1C(=O)Nc1ccc(cc1)-c1ccnc(Nc2ccc(cc2)N2CCOCC2)n1 |r|
Show InChI InChI=1S/C27H32N6O2/c1-2-32-15-3-4-25(32)26(34)29-21-7-5-20(6-8-21)24-13-14-28-27(31-24)30-22-9-11-23(12-10-22)33-16-18-35-19-17-33/h5-14,25H,2-4,15-19H2,1H3,(H,29,34)(H,28,30,31)/t25-/m1/s1
Reactome pathway
n/an/a 557n/an/an/an/an/an/a
Exelixis
Curated by ChEMBL
Assay Description
Inhibition of JAK3
Bioorg Med Chem Lett 22: 7653-8 (2012)
Article DOI: 10.1016/j.bmcl.2012.10.007
BindingDB Entry DOI: 10.7270/Q2PZ59ZN
Tyrosine-protein kinase JAK2
(Homo sapiens (Human))
BDBM50402410
(CHEMBL2207760)
Show SMILES CCN1CCC[C@@H]1C(=O)Nc1ccc(cc1)-c1ccnc(Nc2ccc(cc2)N2CCOCC2)n1 |r|
Show InChI InChI=1S/C27H32N6O2/c1-2-32-15-3-4-25(32)26(34)29-21-7-5-20(6-8-21)24-13-14-28-27(31-24)30-22-9-11-23(12-10-22)33-16-18-35-19-17-33/h5-14,25H,2-4,15-19H2,1H3,(H,29,34)(H,28,30,31)/t25-/m1/s1
Reactome pathway
n/an/a 1.43E+3n/an/an/an/an/an/a
Exelixis
Curated by ChEMBL
Assay Description
Inhibition of JAK2 in HEL 92.1.7 cells assessed as inhibition of STAT1 phosphorylation
Bioorg Med Chem Lett 22: 7653-8 (2012)
Article DOI: 10.1016/j.bmcl.2012.10.007
BindingDB Entry DOI: 10.7270/Q2PZ59ZN