BDBM50402609 CHEMBL2206139
SMILES: CCC(=NNC(=O)c1cc(Br)ccc1O)c1cc2ccccc2[nH]1
InChI Key: InChIKey=HSTMQYAJCULWHK-UHFFFAOYSA-N
Data: 1 IC50
Activity Spreadsheet -- Enzyme Inhibition Constant Data from BindingDB
Found 1 hit for monomerid = 50402609
Trg + Lig
Ki
nM
ΔG°
kcal/mole
IC50
nM
Kd
nM
EC50/IC50
nM
koff
s-1
kon
M-1s-1
pHTemp
°C
Pyruvate kinase
(Staphylococcus aureus (strain MRSA252))
BDBM50402609
(CHEMBL2206139)
Show SMILES CCC(=NNC(=O)c1cc(Br)ccc1O)c1cc2ccccc2[nH]1 |w:3.3|
Show InChI InChI=1S/C18H16BrN3O2/c1-2-14(16-9-11-5-3-4-6-15(11)20-16)21-22-18(24)13-10-12(19)7-8-17(13)23/h3-10,20,23H,2H2,1H3,(H,22,24)
n/an/a 126n/an/an/an/an/an/a
Simon Fraser University
Curated by ChEMBL
Assay Description
Inhibition of methicillin-resistant Staphylococcus aureus 252 pyruvate kinase by LDH assay
Bioorg Med Chem 20: 7069-82 (2012)
Article DOI: 10.1016/j.bmc.2012.10.002
BindingDB Entry DOI: 10.7270/Q2NZ88ST