BDBM50402623 CHEMBL2206165
SMILES: CC(=NNC(=O)c1cc(Br)ccc1O)c1nc2ccccc2n1C
InChI Key: InChIKey=WZPRXMVIAAVQOZ-UHFFFAOYSA-N
Data: 1 IC50
Activity Spreadsheet -- Enzyme Inhibition Constant Data from BindingDB
Found 1 hit for monomerid = 50402623
Trg + Lig
Ki
nM
ΔG°
kcal/mole
IC50
nM
Kd
nM
EC50/IC50
nM
koff
s-1
kon
M-1s-1
pHTemp
°C
Pyruvate kinase
(Staphylococcus aureus (strain MRSA252))
BDBM50402623
(CHEMBL2206165)
Show SMILES CC(=NNC(=O)c1cc(Br)ccc1O)c1nc2ccccc2n1C |w:2.2|
Show InChI InChI=1S/C17H15BrN4O2/c1-10(16-19-13-5-3-4-6-14(13)22(16)2)20-21-17(24)12-9-11(18)7-8-15(12)23/h3-9,23H,1-2H3,(H,21,24)
n/an/a 227n/an/an/an/an/an/a
Simon Fraser University
Curated by ChEMBL
Assay Description
Inhibition of methicillin-resistant Staphylococcus aureus 252 pyruvate kinase by LDH assay
Bioorg Med Chem 20: 7069-82 (2012)
Article DOI: 10.1016/j.bmc.2012.10.002
BindingDB Entry DOI: 10.7270/Q2NZ88ST