BDBM50402633 CHEMBL2206715
SMILES: CC(=NNC(=O)c1cc(Br)ccc1O)c1cc2cc(Cl)ccc2n1C
InChI Key: InChIKey=UAOSXGJONUHITM-UHFFFAOYSA-N
Data: 1 IC50
Activity Spreadsheet -- Enzyme Inhibition Constant Data from BindingDB
Found 1 hit for monomerid = 50402633
Trg + Lig
Ki
nM
ΔG°
kcal/mole
IC50
nM
Kd
nM
EC50/IC50
nM
koff
s-1
kon
M-1s-1
pHTemp
°C
Pyruvate kinase
(Staphylococcus aureus (strain MRSA252))
BDBM50402633
(CHEMBL2206715)
Show SMILES CC(=NNC(=O)c1cc(Br)ccc1O)c1cc2cc(Cl)ccc2n1C |w:2.2|
Show InChI InChI=1S/C18H15BrClN3O2/c1-10(16-8-11-7-13(20)4-5-15(11)23(16)2)21-22-18(25)14-9-12(19)3-6-17(14)24/h3-9,24H,1-2H3,(H,22,25)
n/an/a 228n/an/an/an/an/an/a
Simon Fraser University
Curated by ChEMBL
Assay Description
Inhibition of methicillin-resistant Staphylococcus aureus 252 pyruvate kinase by LDH assay
Bioorg Med Chem 20: 7069-82 (2012)
Article DOI: 10.1016/j.bmc.2012.10.002
BindingDB Entry DOI: 10.7270/Q2NZ88ST