BDBM50402638 CHEMBL2206709
SMILES: CC(=NNC(=O)c1cc(Br)ccc1O)c1cc2cc(F)c(F)cc2[nH]1
InChI Key: InChIKey=PLXUCPUWUZJWCU-UHFFFAOYSA-N
Data: 1 IC50
Activity Spreadsheet -- Enzyme Inhibition Constant Data from BindingDB
Found 1 hit for monomerid = 50402638
Trg + Lig
Ki
nM
ΔG°
kcal/mole
IC50
nM
Kd
nM
EC50/IC50
nM
koff
s-1
kon
M-1s-1
pHTemp
°C
Pyruvate kinase
(Staphylococcus aureus (strain MRSA252))
BDBM50402638
(CHEMBL2206709)
Show SMILES CC(=NNC(=O)c1cc(Br)ccc1O)c1cc2cc(F)c(F)cc2[nH]1 |w:2.2|
Show InChI InChI=1S/C17H12BrF2N3O2/c1-8(14-5-9-4-12(19)13(20)7-15(9)21-14)22-23-17(25)11-6-10(18)2-3-16(11)24/h2-7,21,24H,1H3,(H,23,25)
n/an/a 20n/an/an/an/an/an/a
Simon Fraser University
Curated by ChEMBL
Assay Description
Inhibition of methicillin-resistant Staphylococcus aureus 252 pyruvate kinase by LDH assay
Bioorg Med Chem 20: 7069-82 (2012)
Article DOI: 10.1016/j.bmc.2012.10.002
BindingDB Entry DOI: 10.7270/Q2NZ88ST