BDBM50402641 CHEMBL2206705
SMILES: CC(=NNC(=O)c1cc(Br)ccc1O)c1cc2cc(O)ccc2[nH]1
InChI Key: InChIKey=WYRSATGRZQLAPL-UHFFFAOYSA-N
Data: 1 IC50
Activity Spreadsheet -- Enzyme Inhibition Constant Data from BindingDB
Found 1 hit for monomerid = 50402641
Trg + Lig
Ki
nM
ΔG°
kcal/mole
IC50
nM
Kd
nM
EC50/IC50
nM
koff
s-1
kon
M-1s-1
pHTemp
°C
Pyruvate kinase
(Staphylococcus aureus (strain MRSA252))
BDBM50402641
(CHEMBL2206705)
Show SMILES CC(=NNC(=O)c1cc(Br)ccc1O)c1cc2cc(O)ccc2[nH]1 |w:2.2|
Show InChI InChI=1S/C17H14BrN3O3/c1-9(15-7-10-6-12(22)3-4-14(10)19-15)20-21-17(24)13-8-11(18)2-5-16(13)23/h2-8,19,22-23H,1H3,(H,21,24)
n/an/a 214n/an/an/an/an/an/a
Simon Fraser University
Curated by ChEMBL
Assay Description
Inhibition of methicillin-resistant Staphylococcus aureus 252 pyruvate kinase by LDH assay
Bioorg Med Chem 20: 7069-82 (2012)
Article DOI: 10.1016/j.bmc.2012.10.002
BindingDB Entry DOI: 10.7270/Q2NZ88ST