BDBM50402645 CHEMBL2206725
SMILES: CC(=NNC(=O)c1cc(Br)ccc1O)c1cc2cc(F)ccc2[nH]1
InChI Key: InChIKey=JFFVVJPZUDOAHL-UHFFFAOYSA-N
Data: 1 IC50
Activity Spreadsheet -- Enzyme Inhibition Constant Data from BindingDB
Found 1 hit for monomerid = 50402645
Trg + Lig
Ki
nM
ΔG°
kcal/mole
IC50
nM
Kd
nM
EC50/IC50
nM
koff
s-1
kon
M-1s-1
pHTemp
°C
Pyruvate kinase
(Staphylococcus aureus (strain MRSA252))
BDBM50402645
(CHEMBL2206725)
Show SMILES CC(=NNC(=O)c1cc(Br)ccc1O)c1cc2cc(F)ccc2[nH]1 |w:2.2|
Show InChI InChI=1S/C17H13BrFN3O2/c1-9(15-7-10-6-12(19)3-4-14(10)20-15)21-22-17(24)13-8-11(18)2-5-16(13)23/h2-8,20,23H,1H3,(H,22,24)
n/an/a 49n/an/an/an/an/an/a
Simon Fraser University
Curated by ChEMBL
Assay Description
Inhibition of methicillin-resistant Staphylococcus aureus 252 pyruvate kinase by LDH assay
Bioorg Med Chem 20: 7069-82 (2012)
Article DOI: 10.1016/j.bmc.2012.10.002
BindingDB Entry DOI: 10.7270/Q2NZ88ST