null
SMILES: CC(C)(C)C(=O)c1c(NC(=O)c2ccccc2OC(F)(F)F)sc2COCCc12
InChI Key: InChIKey=SYCJXYVITJBOGA-UHFFFAOYSA-N
Activity Spreadsheet -- Enzyme Inhibition Constant Data from BindingDB
Found 2 hits for monomerid = 50402876
Trg + Lig
Ki
nM
ΔG°
kcal/mole
IC50
nM
Kd
nM
EC50/IC50
nM
koff
s-1
kon
M-1s-1
pHTemp
°C
Cannabinoid receptor 1
(Homo sapiens (Human))
BDBM50402876
(CHEMBL2205613)
Show SMILES CC(C)(C)C(=O)c1c(NC(=O)c2ccccc2OC(F)(F)F)sc2COCCc12
Show InChI InChI=1S/C20H20F3NO4S/c1-19(2,3)16(25)15-12-8-9-27-10-14(12)29-18(15)24-17(26)11-6-4-5-7-13(11)28-20(21,22)23/h4-7H,8-10H2,1-3H3,(H,24,26)
NCI pathway
Reactome pathway
n/an/an/an/a>1.00E+4n/an/an/an/a
Nycomed Pharma Pvt. Ltd
Curated by ChEMBL
Assay Description
Agonist activity at human CB1 receptor after 4 hrs by luciferase reporter gene assay
Bioorg Med Chem Lett 22: 7314-21 (2012)
Article DOI: 10.1016/j.bmcl.2012.10.087
BindingDB Entry DOI: 10.7270/Q2QR4Z9V
Cannabinoid receptor 2
(Homo sapiens (Human))
BDBM50402876
(CHEMBL2205613)
Show SMILES CC(C)(C)C(=O)c1c(NC(=O)c2ccccc2OC(F)(F)F)sc2COCCc12
Show InChI InChI=1S/C20H20F3NO4S/c1-19(2,3)16(25)15-12-8-9-27-10-14(12)29-18(15)24-17(26)11-6-4-5-7-13(11)28-20(21,22)23/h4-7H,8-10H2,1-3H3,(H,24,26)
Reactome pathway
n/an/an/an/a 939n/an/an/an/a
Nycomed Pharma Pvt. Ltd
Curated by ChEMBL
Assay Description
Agonist activity at human CB2 receptor after 4 hrs by luciferase reporter gene assay
Bioorg Med Chem Lett 22: 7314-21 (2012)
Article DOI: 10.1016/j.bmcl.2012.10.087
BindingDB Entry DOI: 10.7270/Q2QR4Z9V