BDBM50402883 CHEMBL2205606
SMILES: FC(F)Oc1ccccc1C(=O)Nc1sc2COCCc2c1C(=O)N1CCOCC1
InChI Key: InChIKey=ABPNWDCSONFZFL-UHFFFAOYSA-N
Data: 2 EC50
Activity Spreadsheet -- Enzyme Inhibition Constant Data from BindingDB
Found 2 hits for monomerid = 50402883
Trg + Lig
Ki
nM
ΔG°
kcal/mole
IC50
nM
Kd
nM
EC50/IC50
nM
koff
s-1
kon
M-1s-1
pHTemp
°C
Cannabinoid receptor 1
(Homo sapiens (Human))
BDBM50402883
(CHEMBL2205606)
Show SMILES FC(F)Oc1ccccc1C(=O)Nc1sc2COCCc2c1C(=O)N1CCOCC1
Show InChI InChI=1S/C20H20F2N2O5S/c21-20(22)29-14-4-2-1-3-12(14)17(25)23-18-16(13-5-8-28-11-15(13)30-18)19(26)24-6-9-27-10-7-24/h1-4,20H,5-11H2,(H,23,25)
NCI pathway
Reactome pathway
n/an/an/an/a>1.00E+4n/an/an/an/a
Nycomed Pharma Pvt. Ltd
Curated by ChEMBL
Assay Description
Agonist activity at human CB1 receptor after 4 hrs by luciferase reporter gene assay
Bioorg Med Chem Lett 22: 7314-21 (2012)
Article DOI: 10.1016/j.bmcl.2012.10.087
BindingDB Entry DOI: 10.7270/Q2QR4Z9V
Cannabinoid receptor 2
(Homo sapiens (Human))
BDBM50402883
(CHEMBL2205606)
Show SMILES FC(F)Oc1ccccc1C(=O)Nc1sc2COCCc2c1C(=O)N1CCOCC1
Show InChI InChI=1S/C20H20F2N2O5S/c21-20(22)29-14-4-2-1-3-12(14)17(25)23-18-16(13-5-8-28-11-15(13)30-18)19(26)24-6-9-27-10-7-24/h1-4,20H,5-11H2,(H,23,25)
Reactome pathway
n/an/an/an/a 488n/an/an/an/a
Nycomed Pharma Pvt. Ltd
Curated by ChEMBL
Assay Description
Agonist activity at human CB2 receptor after 4 hrs by luciferase reporter gene assay
Bioorg Med Chem Lett 22: 7314-21 (2012)
Article DOI: 10.1016/j.bmcl.2012.10.087
BindingDB Entry DOI: 10.7270/Q2QR4Z9V