null
SMILES: FC(F)(F)Oc1ccccc1C(=O)Nc1sc2CC(F)(F)CCc2c1C(=O)N1CC(F)(F)C1
InChI Key: InChIKey=VPQPHFSKIKDKID-UHFFFAOYSA-N
Activity Spreadsheet -- Enzyme Inhibition Constant Data from BindingDB
Found 2 hits for monomerid = 50402893
Trg + Lig
Ki
nM
ΔG°
kcal/mole
IC50
nM
Kd
nM
EC50/IC50
nM
koff
s-1
kon
M-1s-1
pHTemp
°C
Cannabinoid receptor 1
(Homo sapiens (Human))
BDBM50402893
(CHEMBL2204895)
Show SMILES FC(F)(F)Oc1ccccc1C(=O)Nc1sc2CC(F)(F)CCc2c1C(=O)N1CC(F)(F)C1
Show InChI InChI=1S/C20H15F7N2O3S/c21-18(22)6-5-11-13(7-18)33-16(14(11)17(31)29-8-19(23,24)9-29)28-15(30)10-3-1-2-4-12(10)32-20(25,26)27/h1-4H,5-9H2,(H,28,30)
NCI pathway
Reactome pathway
n/an/an/an/a 139n/an/an/an/a
Nycomed Pharma Pvt. Ltd
Curated by ChEMBL
Assay Description
Agonist activity at human CB1 receptor after 4 hrs by luciferase reporter gene assay
Bioorg Med Chem Lett 22: 7314-21 (2012)
Article DOI: 10.1016/j.bmcl.2012.10.087
BindingDB Entry DOI: 10.7270/Q2QR4Z9V
Cannabinoid receptor 2
(Homo sapiens (Human))
BDBM50402893
(CHEMBL2204895)
Show SMILES FC(F)(F)Oc1ccccc1C(=O)Nc1sc2CC(F)(F)CCc2c1C(=O)N1CC(F)(F)C1
Show InChI InChI=1S/C20H15F7N2O3S/c21-18(22)6-5-11-13(7-18)33-16(14(11)17(31)29-8-19(23,24)9-29)28-15(30)10-3-1-2-4-12(10)32-20(25,26)27/h1-4H,5-9H2,(H,28,30)
Reactome pathway
n/an/an/an/a 18n/an/an/an/a
Nycomed Pharma Pvt. Ltd
Curated by ChEMBL
Assay Description
Agonist activity at human CB2 receptor after 4 hrs by luciferase reporter gene assay
Bioorg Med Chem Lett 22: 7314-21 (2012)
Article DOI: 10.1016/j.bmcl.2012.10.087
BindingDB Entry DOI: 10.7270/Q2QR4Z9V