BDBM50402896 CHEMBL2204892
SMILES: CC1OCc2sc(NC(=O)CC(C)(C)C)c(C(=O)N3CC(F)(F)C3)c12
InChI Key: InChIKey=MWFWGBCEXJTOQK-UHFFFAOYSA-N
Data: 2 EC50
Activity Spreadsheet -- Enzyme Inhibition Constant Data from BindingDB
Found 2 hits for monomerid = 50402896
Trg + Lig
Ki
nM
ΔG°
kcal/mole
IC50
nM
Kd
nM
EC50/IC50
nM
koff
s-1
kon
M-1s-1
pHTemp
°C
Cannabinoid receptor 1
(Homo sapiens (Human))
BDBM50402896
(CHEMBL2204892)
Show SMILES CC1OCc2sc(NC(=O)CC(C)(C)C)c(C(=O)N3CC(F)(F)C3)c12
Show InChI InChI=1S/C17H22F2N2O3S/c1-9-12-10(6-24-9)25-14(20-11(22)5-16(2,3)4)13(12)15(23)21-7-17(18,19)8-21/h9H,5-8H2,1-4H3,(H,20,22)
NCI pathway
Reactome pathway
n/an/an/an/a 217n/an/an/an/a
Nycomed Pharma Pvt. Ltd
Curated by ChEMBL
Assay Description
Agonist activity at human CB1 receptor after 4 hrs by luciferase reporter gene assay
Bioorg Med Chem Lett 22: 7314-21 (2012)
Article DOI: 10.1016/j.bmcl.2012.10.087
BindingDB Entry DOI: 10.7270/Q2QR4Z9V
Cannabinoid receptor 2
(Homo sapiens (Human))
BDBM50402896
(CHEMBL2204892)
Show SMILES CC1OCc2sc(NC(=O)CC(C)(C)C)c(C(=O)N3CC(F)(F)C3)c12
Show InChI InChI=1S/C17H22F2N2O3S/c1-9-12-10(6-24-9)25-14(20-11(22)5-16(2,3)4)13(12)15(23)21-7-17(18,19)8-21/h9H,5-8H2,1-4H3,(H,20,22)
Reactome pathway
n/an/an/an/a 6n/an/an/an/a
Nycomed Pharma Pvt. Ltd
Curated by ChEMBL
Assay Description
Agonist activity at human CB2 receptor after 4 hrs by luciferase reporter gene assay
Bioorg Med Chem Lett 22: 7314-21 (2012)
Article DOI: 10.1016/j.bmcl.2012.10.087
BindingDB Entry DOI: 10.7270/Q2QR4Z9V