BDBM50403094 CHEMBL2216879
SMILES: CC(C)Cn1cnc2oc(C)c(C(=O)NCc3ccccc3)c2c1=O
InChI Key: InChIKey=FEAHSVWAGDLERI-UHFFFAOYSA-N
Data: 1 IC50
Activity Spreadsheet -- Enzyme Inhibition Constant Data from BindingDB
Found 1 hit for monomerid = 50403094
Trg + Lig
Ki
nM
ΔG°
kcal/mole
IC50
nM
Kd
nM
EC50/IC50
nM
koff
s-1
kon
M-1s-1
pHTemp
°C
Phosphatidylinositol 4,5-bisphosphate 3-kinase catalytic subunit delta isoform
(Homo sapiens (Human))
BDBM50403094
(CHEMBL2216879)
Show SMILES CC(C)Cn1cnc2oc(C)c(C(=O)NCc3ccccc3)c2c1=O
Show InChI InChI=1S/C19H21N3O3/c1-12(2)10-22-11-21-18-16(19(22)24)15(13(3)25-18)17(23)20-9-14-7-5-4-6-8-14/h4-8,11-12H,9-10H2,1-3H3,(H,20,23)
NCI pathway
Reactome pathway
n/an/a 2.10E+3n/an/an/an/an/an/a
Amgen Inc.
Curated by ChEMBL
Assay Description
Inhibition of PI3Kdelta
J Med Chem 55: 8559-81 (2012)
Article DOI: 10.1021/jm300847w
BindingDB Entry DOI: 10.7270/Q2SN0B47