BDBM50403304 CHEMBL420192
SMILES: OC(=O)CN1[C@@H](CSC[C@H](NC(=O)[C@@H](S)Cc2ccccc2)C1=O)c1ccccc1
InChI Key: InChIKey=ZVXOVHYLULMGIL-FHWLQOOXSA-N
Data: 2 IC50
Activity Spreadsheet -- Enzyme Inhibition Constant Data from BindingDB
Found 2 hits for monomerid = 50403304
Trg + Lig
Ki
nM
ΔG°
kcal/mole
IC50
nM
Kd
nM
EC50/IC50
nM
koff
s-1
kon
M-1s-1
pHTemp
°C
Angiotensin-converting enzyme
(Rattus norvegicus)
BDBM50403304
(CHEMBL420192)
Show SMILES OC(=O)CN1[C@@H](CSC[C@H](NC(=O)[C@@H](S)Cc2ccccc2)C1=O)c1ccccc1
Show InChI InChI=1S/C22H24N2O4S2/c25-20(26)12-24-18(16-9-5-2-6-10-16)14-30-13-17(22(24)28)23-21(27)19(29)11-15-7-3-1-4-8-15/h1-10,17-19,29H,11-14H2,(H,23,27)(H,25,26)/t17-,18-,19-/m0/s1
n/an/a 29n/an/an/an/an/an/a
TBA
Curated by ChEMBL
Assay Description
In vitro inhibition of angiotensin converting enzyme isolated from rat lung.
Bioorg Med Chem Lett 4: 2193-2198 (1994)
Article DOI: 10.1016/S0960-894X(00)80070-0
BindingDB Entry DOI: 10.7270/Q2F47Q9D
Neutral Endopeptidase (NEP)
(Rattus norvegicus (Rat))
BDBM50403304
(CHEMBL420192)
Show SMILES OC(=O)CN1[C@@H](CSC[C@H](NC(=O)[C@@H](S)Cc2ccccc2)C1=O)c1ccccc1
Show InChI InChI=1S/C22H24N2O4S2/c25-20(26)12-24-18(16-9-5-2-6-10-16)14-30-13-17(22(24)28)23-21(27)19(29)11-15-7-3-1-4-8-15/h1-10,17-19,29H,11-14H2,(H,23,27)(H,25,26)/t17-,18-,19-/m0/s1
Reactome pathway
n/an/a 2.02E+3n/an/an/an/an/an/a
TBA
Curated by ChEMBL
Assay Description
In vitro inhibition of Neutral Endopeptidase isolated from rat kidney.
Bioorg Med Chem Lett 4: 2193-2198 (1994)
Article DOI: 10.1016/S0960-894X(00)80070-0
BindingDB Entry DOI: 10.7270/Q2F47Q9D