null
SMILES: CN(C)CCc1cnc([nH]1)-c1cccc(c1)C(F)(F)F
InChI Key: InChIKey=GOHPIKDATUAMSC-UHFFFAOYSA-N
Activity Spreadsheet -- Enzyme Inhibition Constant Data from BindingDB
Found 4 hits for monomerid = 50403675
Trg + Lig
Ki
nM
ΔG°
kcal/mole
IC50
nM
Kd
nM
EC50/IC50
nM
koff
s-1
kon
M-1s-1
pHTemp
°C
Histamine H1 receptor
(Cavia porcellus (domestic guinea pig))
BDBM50403675
(CHEMBL314438)
Show SMILES CN(C)CCc1cnc([nH]1)-c1cccc(c1)C(F)(F)F
Show InChI InChI=1S/C14H16F3N3/c1-20(2)7-6-12-9-18-13(19-12)10-4-3-5-11(8-10)14(15,16)17/h3-5,8-9H,6-7H2,1-2H3,(H,18,19)
n/an/an/a 1.20n/an/an/an/an/a
Freie Universit£t Berlin
Curated by ChEMBL
Assay Description
Contractile effects antagonized by mepyramine (0.3-100 nM) against Histamine H1 receptor in guinea pig ileum
Bioorg Med Chem Lett 8: 2583-8 (1999)
BindingDB Entry DOI: 10.7270/Q2G1621V
Histamine H3 receptor
(GUINEA PIG)
BDBM50403675
(CHEMBL314438)
Show SMILES CN(C)CCc1cnc([nH]1)-c1cccc(c1)C(F)(F)F
Show InChI InChI=1S/C14H16F3N3/c1-20(2)7-6-12-9-18-13(19-12)10-4-3-5-11(8-10)14(15,16)17/h3-5,8-9H,6-7H2,1-2H3,(H,18,19)
n/an/an/a 1.12E+3n/an/an/an/an/a
Freie Universit£t Berlin
Curated by ChEMBL
Assay Description
Compound was tested for the agonist activity against histamine H3 receptor of guinea pig ileum
Bioorg Med Chem Lett 8: 2583-8 (1999)
BindingDB Entry DOI: 10.7270/Q2G1621V
Histamine H1 receptor
(Cavia porcellus (domestic guinea pig))
BDBM50403675
(CHEMBL314438)
Show SMILES CN(C)CCc1cnc([nH]1)-c1cccc(c1)C(F)(F)F
Show InChI InChI=1S/C14H16F3N3/c1-20(2)7-6-12-9-18-13(19-12)10-4-3-5-11(8-10)14(15,16)17/h3-5,8-9H,6-7H2,1-2H3,(H,18,19)
n/an/an/a 1.41n/an/an/an/an/a
Freie Universit£t Berlin
Curated by ChEMBL
Assay Description
Compound was tested for the contractile effects antagonized by mepyramine (1-1000 nM) against Histamine H1 receptor of guinea pig aorta.
Bioorg Med Chem Lett 8: 2583-8 (1999)
BindingDB Entry DOI: 10.7270/Q2G1621V
Muscarinic acetylcholine receptor
(Cavia porcellus)
BDBM50403675
(CHEMBL314438)
Show SMILES CN(C)CCc1cnc([nH]1)-c1cccc(c1)C(F)(F)F
Show InChI InChI=1S/C14H16F3N3/c1-20(2)7-6-12-9-18-13(19-12)10-4-3-5-11(8-10)14(15,16)17/h3-5,8-9H,6-7H2,1-2H3,(H,18,19)
Reactome pathway
n/an/an/a 2.69E+4n/an/an/an/an/a
Freie Universit£t Berlin
Curated by ChEMBL
Assay Description
Compound was tested for its agonist activity against M3-acetylcholine receptor of guinea pig ileum.
Bioorg Med Chem Lett 8: 2583-8 (1999)
BindingDB Entry DOI: 10.7270/Q2G1621V