BDBM50403806 CHEMBL2370132::TC-14003
SMILES: [H][C@@]12[#6]-[#6]-[#6]-[#7]1-[#6](=O)-[#6@@H](-[#6]-[#6]-[#6]-[#6]-[#7])-[#7]-[#6](=O)-[#6@H](-[#6]-[#6]-[#6]-[#6]-[#7])-[#7]-[#6](=O)-[#6@H](-[#6]-[#6]-[#6]\[#7]=[#6](/[#7])-[#7])-[#7]-[#6](=O)-[#6@H](-[#6]-c1ccc(-[#8])cc1)-[#7]-[#6](=O)-[#6@H](-[#6]-[#16]-[#16]-[#6]-[#6@H](-[#7]-[#6](=O)-[#6@H](-[#6]-[#6]-[#6]-[#7]-[#6](-[#7])=O)-[#7]-[#6](=O)-[#6@H](-[#6]-[#6]-[#6]-[#7]-[#6](-[#7])=O)-[#7]-[#6](=O)-[#6@H](-[#6]-c1ccc(-[#8])cc1)-[#7]-[#6]2=O)-[#6](=O)-[#7]-[#6@@H](-[#6]-[#6]-[#6]\[#7]=[#6](\[#7])-[#7])-[#6](-[#8])=O)-[#7]-[#6](=O)-[#6@H](-[#6]-c1ccc2ccccc2c1)-[#7]-[#6](=O)-[#6@H](-[#6]-[#6]-[#6]\[#7]=[#6](\[#7])-[#7])-[#7]-[#6](=O)-[#6@@H](-[#7])-[#6]-[#6]-[#6]\[#7]=[#6](\[#7])-[#7]
InChI Key: InChIKey=BVHSOARFKLTTOC-ADZSTZGASA-N
Data: 1 EC50
Activity Spreadsheet -- Enzyme Inhibition Constant Data from BindingDB
Found 1 hit for monomerid = 50403806
Trg + Lig
Ki
nM
ΔG°
kcal/mole
IC50
nM
Kd
nM
EC50/IC50
nM
koff
s-1
kon
M-1s-1
pHTemp
°C
C-X-C chemokine receptor type 4
(Homo sapiens (Human))
BDBM50403806
(CHEMBL2370132 | TC-14003)
Show SMILES [H][C@@]12[#6]-[#6]-[#6]-[#7]1-[#6](=O)-[#6@@H](-[#6]-[#6]-[#6]-[#6]-[#7])-[#7]-[#6](=O)-[#6@H](-[#6]-[#6]-[#6]-[#6]-[#7])-[#7]-[#6](=O)-[#6@H](-[#6]-[#6]-[#6]\[#7]=[#6](/[#7])-[#7])-[#7]-[#6](=O)-[#6@H](-[#6]-c1ccc(-[#8])cc1)-[#7]-[#6](=O)-[#6@H](-[#6]-[#16]-[#16]-[#6]-[#6@H](-[#7]-[#6](=O)-[#6@H](-[#6]-[#6]-[#6]-[#7]-[#6](-[#7])=O)-[#7]-[#6](=O)-[#6@H](-[#6]-[#6]-[#6]-[#7]-[#6](-[#7])=O)-[#7]-[#6](=O)-[#6@H](-[#6]-c1ccc(-[#8])cc1)-[#7]-[#6]2=O)-[#6](=O)-[#7]-[#6@@H](-[#6]-[#6]-[#6]\[#7]=[#6](\[#7])-[#7])-[#6](-[#8])=O)-[#7]-[#6](=O)-[#6@H](-[#6]-c1ccc2ccccc2c1)-[#7]-[#6](=O)-[#6@H](-[#6]-[#6]-[#6]\[#7]=[#6](\[#7])-[#7])-[#7]-[#6](=O)-[#6@@H](-[#7])-[#6]-[#6]-[#6]\[#7]=[#6](\[#7])-[#7]
Show InChI InChI=1S/C90H140N32O19S2/c91-35-5-3-17-58-74(128)115-63(18-4-6-36-92)83(137)122-43-13-24-70(122)82(136)119-66(46-51-28-33-56(124)34-29-51)78(132)114-61(21-10-41-108-89(102)140)73(127)112-62(22-11-42-109-90(103)141)76(130)120-68(80(134)116-64(84(138)139)23-12-40-107-88(100)101)48-142-143-49-69(81(135)118-65(45-50-26-31-55(123)32-27-50)77(131)113-60(72(126)111-58)20-9-39-106-87(98)99)121-79(133)67(47-52-25-30-53-14-1-2-15-54(53)44-52)117-75(129)59(19-8-38-105-86(96)97)110-71(125)57(93)16-7-37-104-85(94)95/h1-2,14-15,25-34,44,57-70,123-124H,3-13,16-24,35-43,45-49,91-93H2,(H,110,125)(H,111,126)(H,112,127)(H,113,131)(H,114,132)(H,115,128)(H,116,134)(H,117,129)(H,118,135)(H,119,136)(H,120,130)(H,121,133)(H,138,139)(H4,94,95,104)(H4,96,97,105)(H4,98,99,106)(H4,100,101,107)(H3,102,108,140)(H3,103,109,141)/t57-,58-,59-,60-,61-,62-,63+,64-,65-,66-,67-,68-,69-,70-/m0/s1
n/an/an/an/a 15n/an/an/an/a
Kyoto University
Curated by ChEMBL
Assay Description
Inhibition of HIV-induced cytopathogenicity in MT-4 cell
Bioorg Med Chem Lett 10: 2633-7 (2000)
BindingDB Entry DOI: 10.7270/Q2988866