null
SMILES: Cc1cn([C@H]2C[C@H](O[Si](C)(C)C(C)(C)C)[C@@H](CO[Si](C)(C)C(C)(C)C)O2)c(=O)n(CC(=O)OCc2ccccc2)c1=O
InChI Key: InChIKey=XJGABQAQKYATOA-UHFFFAOYSA-N
Activity Spreadsheet -- Enzyme Inhibition Constant Data from BindingDB
Found 1 hit for monomerid = 50403885
Trg + Lig
Ki
nM
ΔG°
kcal/mole
IC50
nM
Kd
nM
EC50/IC50
nM
koff
s-1
kon
M-1s-1
pHTemp
°C
Reverse transcriptase/RNaseH
(Human immunodeficiency virus 1)
BDBM50403885
(CHEMBL104540 | CHEMBL3142811)
Show SMILES Cc1cn([C@H]2C[C@H](O[Si](C)(C)C(C)(C)C)[C@@H](CO[Si](C)(C)C(C)(C)C)O2)c(=O)n(CC(=O)OCc2ccccc2)c1=O |r|
Show InChI InChI=1S/C31H50N2O7Si2/c1-22-18-32(29(36)33(28(22)35)19-27(34)37-20-23-15-13-12-14-16-23)26-17-24(40-42(10,11)31(5,6)7)25(39-26)21-38-41(8,9)30(2,3)4/h12-16,18,24-26H,17,19-21H2,1-11H3
n/an/an/an/a>1.00E+4n/an/an/an/a
Instituto de Química Médica (C.S.I.C.)
Curated by ChEMBL
Assay Description
Effective concentration required to inhibit HIV-1 induced cytopathicity by 50% in CEM cells
Bioorg Med Chem Lett 11: 3085-8 (2001)
BindingDB Entry DOI: 10.7270/Q2QC02S2