BDBM50404073 CHEMBL128101
SMILES: Clc1ccccc1C(=O)NCCC12CC3CC(CC(C3)C1)C2
InChI Key: InChIKey=DLXKIWBTHUZOKV-UHFFFAOYSA-N
Data: 1 Kd
Activity Spreadsheet -- Enzyme Inhibition Constant Data from BindingDB
Found 1 hit for monomerid = 50404073
Trg + Lig
Ki
nM
ΔG°
kcal/mole
IC50
nM
Kd
nM
EC50/IC50
nM
koff
s-1
kon
M-1s-1
pHTemp
°C
P2X purinoceptor 7
(Homo sapiens (Human))
BDBM50404073
(CHEMBL128101)
Show SMILES Clc1ccccc1C(=O)NCCC12CC3CC(CC(C3)C1)C2 |TLB:15:16:20:14.13.19,THB:15:14:20:16.21.17,17:18:13:16.21.15,17:16:13:18.20.19|
Show InChI InChI=1S/C19H24ClNO/c20-17-4-2-1-3-16(17)18(22)21-6-5-19-10-13-7-14(11-19)9-15(8-13)12-19/h1-4,13-15H,5-12H2,(H,21,22)
n/an/an/a 15.8n/an/an/an/an/a
AstraZeneca
Curated by ChEMBL
Assay Description
Antagonist activity at P2X7 receptor in human THP1 cells assessed as inhibition of BzATP-induced ethidium uptake
J Med Chem 52: 3123-41 (2009)
Article DOI: 10.1021/jm801528x
BindingDB Entry DOI: 10.7270/Q2251KDR