BDBM50404085 CHEMBL336619
SMILES: Clc1ccccc1C(=O)NCC12CC3CC(CC(C3)C1)C2
InChI Key: InChIKey=KGXOEHIYVHCAAK-UHFFFAOYSA-N
Data: 1 IC50  1 Kd
Activity Spreadsheet -- Enzyme Inhibition Constant Data from BindingDB
Found 2 hits for monomerid = 50404085
Trg + Lig
Ki
nM
ΔG°
kcal/mole
IC50
nM
Kd
nM
EC50/IC50
nM
koff
s-1
kon
M-1s-1
pHTemp
°C
P2X purinoceptor 7
(Homo sapiens (Human))
BDBM50404085
(CHEMBL336619)
Show SMILES Clc1ccccc1C(=O)NCC12CC3CC(CC(C3)C1)C2 |TLB:18:13:20:17.19.16,18:17:20:13.12.14,THB:16:17:12:15.20.14,16:15:12:17.19.18|
Show InChI InChI=1S/C18H22ClNO/c19-16-4-2-1-3-15(16)17(21)20-11-18-8-12-5-13(9-18)7-14(6-12)10-18/h1-4,12-14H,5-11H2,(H,20,21)
n/an/a 7.90n/an/an/an/an/an/a
Punjabi University
Curated by ChEMBL
Assay Description
Antagonist activity at P2X7 receptor (unknown origin)
Bioorg Med Chem 22: 54-88 (2014)
Article DOI: 10.1016/j.bmc.2013.10.054
BindingDB Entry DOI: 10.7270/Q27M0BX7
P2X purinoceptor 7
(Homo sapiens (Human))
BDBM50404085
(CHEMBL336619)
Show SMILES Clc1ccccc1C(=O)NCC12CC3CC(CC(C3)C1)C2 |TLB:18:13:20:17.19.16,18:17:20:13.12.14,THB:16:17:12:15.20.14,16:15:12:17.19.18|
Show InChI InChI=1S/C18H22ClNO/c19-16-4-2-1-3-15(16)17(21)20-11-18-8-12-5-13(9-18)7-14(6-12)10-18/h1-4,12-14H,5-11H2,(H,20,21)
n/an/an/a 7.94n/an/an/an/an/a
AstraZeneca
Curated by ChEMBL
Assay Description
Antagonist activity at P2X7 receptor in human THP1 cells assessed as inhibition of BzATP-induced ethidium uptake
J Med Chem 52: 3123-41 (2009)
Article DOI: 10.1021/jm801528x
BindingDB Entry DOI: 10.7270/Q2251KDR