BDBM50404229 CHEMBL24089
SMILES: Clc1cccc(c1)-c1ccc2NC(=S)C3(CCCCC3)c2c1
InChI Key: InChIKey=LFOKDLJVIJPCIT-UHFFFAOYSA-N
Data: 1 IC50  1 EC50
Activity Spreadsheet -- Enzyme Inhibition Constant Data from BindingDB
Found 2 hits for monomerid = 50404229
Trg + Lig
Ki
nM
ΔG°
kcal/mole
IC50
nM
Kd
nM
EC50/IC50
nM
koff
s-1
kon
M-1s-1
pHTemp
°C
Progesterone receptor
(Rattus norvegicus)
BDBM50404229
(CHEMBL24089)
Show SMILES Clc1cccc(c1)-c1ccc2NC(=S)C3(CCCCC3)c2c1
Show InChI InChI=1S/C19H18ClNS/c20-15-6-4-5-13(11-15)14-7-8-17-16(12-14)19(18(22)21-17)9-2-1-3-10-19/h4-8,11-12H,1-3,9-10H2,(H,21,22)
n/an/a 0.370n/an/an/an/an/an/a
Wyeth Research
Curated by ChEMBL
Assay Description
Inhibitory progestational activity on oral administration in uterine C3 model
Bioorg Med Chem Lett 13: 1317-20 (2003)
BindingDB Entry DOI: 10.7270/Q2WS8SNP
Progesterone receptor
(Homo sapiens (Human))
BDBM50404229
(CHEMBL24089)
Show SMILES Clc1cccc(c1)-c1ccc2NC(=S)C3(CCCCC3)c2c1
Show InChI InChI=1S/C19H18ClNS/c20-15-6-4-5-13(11-15)14-7-8-17-16(12-14)19(18(22)21-17)9-2-1-3-10-19/h4-8,11-12H,1-3,9-10H2,(H,21,22)
n/an/an/an/a 1.60n/an/an/an/a
Wyeth Research
Curated by ChEMBL
Assay Description
Effective concentration of progesterone receptor agonist induction of alkaline phosphatase activity in human T47D breast carcinoma cells
Bioorg Med Chem Lett 13: 1317-20 (2003)
BindingDB Entry DOI: 10.7270/Q2WS8SNP