BDBM50404263 CHEMBL106661
SMILES: Cc1c(Cc2cccc3ccccc23)nc(SCC(=O)c2ccc(Cl)cc2)[nH]c1=O
InChI Key: InChIKey=CFFFHVMLJMFGFZ-UHFFFAOYSA-N
Data: 1 IC50
Activity Spreadsheet -- Enzyme Inhibition Constant Data from BindingDB
Found 1 hit for monomerid = 50404263
Trg + Lig
Ki
nM
ΔG°
kcal/mole
IC50
nM
Kd
nM
EC50/IC50
nM
koff
s-1
kon
M-1s-1
pHTemp
°C
Reverse transcriptase/RNaseH
(Human immunodeficiency virus 1)
BDBM50404263
(CHEMBL106661)
Show SMILES Cc1c(Cc2cccc3ccccc23)nc(SCC(=O)c2ccc(Cl)cc2)[nH]c1=O
Show InChI InChI=1S/C24H19ClN2O2S/c1-15-21(13-18-7-4-6-16-5-2-3-8-20(16)18)26-24(27-23(15)29)30-14-22(28)17-9-11-19(25)12-10-17/h2-12H,13-14H2,1H3,(H,26,27,29)
n/an/a 550n/an/an/an/an/an/a
Fudan University
Curated by ChEMBL
Assay Description
Concentration required to protect the cell against HIV-1 strain IIIB viral cytopathogenicity by 50% in MT-4 cells
Bioorg Med Chem Lett 14: 3173-6 (2004)
Article DOI: 10.1016/j.bmcl.2004.04.008
BindingDB Entry DOI: 10.7270/Q2862HNN