BDBM50404267 CHEMBL106204
SMILES: CC(=O)CSc1nc(Cc2cccc3ccccc23)c(C)c(=O)[nH]1
InChI Key: InChIKey=BFQCFZRCYZRCMI-UHFFFAOYSA-N
Data: 1 IC50
Activity Spreadsheet -- Enzyme Inhibition Constant Data from BindingDB
Found 1 hit for monomerid = 50404267
Trg + Lig
Ki
nM
ΔG°
kcal/mole
IC50
nM
Kd
nM
EC50/IC50
nM
koff
s-1
kon
M-1s-1
pHTemp
°C
Reverse transcriptase/RNaseH
(Human immunodeficiency virus 1)
BDBM50404267
(CHEMBL106204)
Show SMILES CC(=O)CSc1nc(Cc2cccc3ccccc23)c(C)c(=O)[nH]1
Show InChI InChI=1S/C19H18N2O2S/c1-12(22)11-24-19-20-17(13(2)18(23)21-19)10-15-8-5-7-14-6-3-4-9-16(14)15/h3-9H,10-11H2,1-2H3,(H,20,21,23)
n/an/a 1.12E+3n/an/an/an/an/an/a
Fudan University
Curated by ChEMBL
Assay Description
Concentration required to protect the cell against HIV-1 strain IIIB viral cytopathogenicity by 50% in MT-4 cells
Bioorg Med Chem Lett 14: 3173-6 (2004)
Article DOI: 10.1016/j.bmcl.2004.04.008
BindingDB Entry DOI: 10.7270/Q2862HNN